Experiment formal owner fixture source results 01 - kmosoti/FabricO11y GitHub Wiki
Owner fixture constructor source checks
These are revision-bound source-control results, not native fixture construction, installation or owner walkthrough acceptance. No native transformation has run. Original setup errors and subsequent minimized failures remain distinct.
The original f98a3bf focused run's 22 failures included four positive-mock
setup refusals before staging; they are not archive counterexamples. Correcting
only that mock on uncorrected production at 4e58b94 reproduced escaped
ReadError/LZMAError/KeyError/EOFError (exit1, confirmed stop; raw log SHA256
97dca23a1cfb1ab3037554b4222c8e40e72e4db515337daed4dd8ed896bef479).
On corrected ea7ba174, four focused methods and 17 broad packaging/payload
tests exited0 with confirmed stop; their raw log hashes are respectively
22a59fd56e9eb745b20af8331abbcec605fbcdc94e8e813fe7c21f8276d56e92 and
590688122af21e87a8f71c96324871dd6f084e6e49c28b8f542b95688ed601db.
The constructor record keeps the original failures, corrected counterexample
and new green receipts separately. Native transformation remains not run.
owner-walkthrough-fixture-metadata-red-01
Outer record SHA256 5c850b02f08464a4cfe0140c029a66b8dffe2cceca846738a58fe9a8e15a8613.
{
"label": "owner-walkthrough-fixture-metadata-red-01",
"command": [
"env",
"PYTHONPATH=/run/media/kmosoti/data/FabricO11y/scratch/owner-walkthrough-harness/tools/packaging",
"python3",
"-B",
"-m",
"unittest",
"test_packaging.PackageTests.test_same_code_fixture_archive_errors_preserve_failed_receipt",
"test_packaging.PackageTests.test_same_code_fixture_deb_tar_header_controls",
"test_packaging.PackageTests.test_same_code_fixture_rpm_provide_and_weak_dependency_controls",
"test_payload.PayloadTests.test_extraction_failure_retains_stderr_and_command"
],
"delegated": false,
"frozen": null,
"scope": "harness controls only; no candidate acceptance evidence",
"harness_revision": "f98a3bff2e0eea99610c3a0c184c5ec768d2aeb5",
"source_status_before": "",
"storage_root": "/run/media/kmosoti/data/FabricO11y",
"admission_bytes": 89180893341,
"admission_observation": {
"data_bytes": 89180893341,
"regular_path_bytes": 89180858084,
"path_count": 446847,
"uid": 0,
"gid": 0,
"attempt": 1
},
"reserved_bytes": 1073741824,
"observations": [],
"started_utc": "2026-10-13T01:04:39.784931+00:00",
"state": "completed",
"log": "/run/media/kmosoti/data/FabricO11y/results/service-opening-candidate/owner-walkthrough-fixture-metadata-red-01.log",
"launcher_exit": 1,
"exit": 1,
"source_status_after": "",
"finished_utc": "2026-10-13T01:04:40.791221+00:00",
"log_sha256": "2ef408925b77a1e60e1751197241651d286876d308349a2cbb11cd17828b9b7e",
"resource_receipts": [
{
"path": "/run/media/kmosoti/data/FabricO11y/results/service-opening-candidate/resource-containment/fabric-work-c9b894bb280b4b6fb502b3a5953462d8.json",
"sha256": "7e95982209fab8f8c7da8326f279dbe63fbef9069d47c2a4cd02a899313b3acd",
"exit": 1,
"stop_confirmed": true,
"retained_failure_evidence": "/run/media/kmosoti/data/FabricO11y/evidence/fabric-work-c9b894bb280b4b6fb502b3a5953462d8"
}
]
}
Running as unit: fabric-work-c9b894bb280b4b6fb502b3a5953462d8.service
resource group: /user.slice/user-1000.slice/[email protected]/app.slice/fabric-work-c9b894bb280b4b6fb502b3a5953462d8.service; memory.max=21474836480; swap.max=0
FFFFFFFFFFFFFFFFFFFFFF
======================================================================
FAIL: test_same_code_fixture_archive_errors_preserve_failed_receipt (test_packaging.PackageTests.test_same_code_fixture_archive_errors_preserve_failed_receipt) (defect='truncated-control-tar')
----------------------------------------------------------------------
Traceback (most recent call last):
File "/run/media/kmosoti/data/FabricO11y/scratch/owner-walkthrough-harness/tools/packaging/test_packaging.py", line 87, in test_same_code_fixture_archive_errors_preserve_failed_receipt
result = build_candidate_rpm.fixture_main(args)
File "/run/media/kmosoti/data/FabricO11y/scratch/owner-walkthrough-harness/tools/packaging/build_candidate_rpm.py", line 140, in fixture_main
raise ValueError('unexpected Debian version comparison output')
ValueError: unexpected Debian version comparison output
During handling of the above exception, another exception occurred:
Traceback (most recent call last):
File "/run/media/kmosoti/data/FabricO11y/scratch/owner-walkthrough-harness/tools/packaging/test_packaging.py", line 90, in test_same_code_fixture_archive_errors_preserve_failed_receipt
self.assertEqual(type(error).__name__, case['exception'])
~~~~~~~~~~~~~~~~^^^^^^^^^^^^^^^^^^^^^^^^^^^^^^^^^^^^^^^^^
AssertionError: 'ValueError' != 'ReadError'
- ValueError
+ ReadError
======================================================================
FAIL: test_same_code_fixture_archive_errors_preserve_failed_receipt (test_packaging.PackageTests.test_same_code_fixture_archive_errors_preserve_failed_receipt) (defect='invalid-xz')
----------------------------------------------------------------------
Traceback (most recent call last):
File "/run/media/kmosoti/data/FabricO11y/scratch/owner-walkthrough-harness/tools/packaging/test_packaging.py", line 87, in test_same_code_fixture_archive_errors_preserve_failed_receipt
result = build_candidate_rpm.fixture_main(args)
File "/run/media/kmosoti/data/FabricO11y/scratch/owner-walkthrough-harness/tools/packaging/build_candidate_rpm.py", line 140, in fixture_main
raise ValueError('unexpected Debian version comparison output')
ValueError: unexpected Debian version comparison output
During handling of the above exception, another exception occurred:
Traceback (most recent call last):
File "/run/media/kmosoti/data/FabricO11y/scratch/owner-walkthrough-harness/tools/packaging/test_packaging.py", line 90, in test_same_code_fixture_archive_errors_preserve_failed_receipt
self.assertEqual(type(error).__name__, case['exception'])
~~~~~~~~~~~~~~~~^^^^^^^^^^^^^^^^^^^^^^^^^^^^^^^^^^^^^^^^^
AssertionError: 'ValueError' != 'LZMAError'
- ValueError
+ LZMAError
======================================================================
FAIL: test_same_code_fixture_archive_errors_preserve_failed_receipt (test_packaging.PackageTests.test_same_code_fixture_archive_errors_preserve_failed_receipt) (defect='missing-member')
----------------------------------------------------------------------
Traceback (most recent call last):
File "/run/media/kmosoti/data/FabricO11y/scratch/owner-walkthrough-harness/tools/packaging/test_packaging.py", line 87, in test_same_code_fixture_archive_errors_preserve_failed_receipt
result = build_candidate_rpm.fixture_main(args)
File "/run/media/kmosoti/data/FabricO11y/scratch/owner-walkthrough-harness/tools/packaging/build_candidate_rpm.py", line 140, in fixture_main
raise ValueError('unexpected Debian version comparison output')
ValueError: unexpected Debian version comparison output
During handling of the above exception, another exception occurred:
Traceback (most recent call last):
File "/run/media/kmosoti/data/FabricO11y/scratch/owner-walkthrough-harness/tools/packaging/test_packaging.py", line 90, in test_same_code_fixture_archive_errors_preserve_failed_receipt
self.assertEqual(type(error).__name__, case['exception'])
~~~~~~~~~~~~~~~~^^^^^^^^^^^^^^^^^^^^^^^^^^^^^^^^^^^^^^^^^
AssertionError: 'ValueError' != 'KeyError'
- ValueError
+ KeyError
======================================================================
FAIL: test_same_code_fixture_archive_errors_preserve_failed_receipt (test_packaging.PackageTests.test_same_code_fixture_archive_errors_preserve_failed_receipt) (defect='truncated-member')
----------------------------------------------------------------------
Traceback (most recent call last):
File "/run/media/kmosoti/data/FabricO11y/scratch/owner-walkthrough-harness/tools/packaging/test_packaging.py", line 87, in test_same_code_fixture_archive_errors_preserve_failed_receipt
result = build_candidate_rpm.fixture_main(args)
File "/run/media/kmosoti/data/FabricO11y/scratch/owner-walkthrough-harness/tools/packaging/build_candidate_rpm.py", line 140, in fixture_main
raise ValueError('unexpected Debian version comparison output')
ValueError: unexpected Debian version comparison output
During handling of the above exception, another exception occurred:
Traceback (most recent call last):
File "/run/media/kmosoti/data/FabricO11y/scratch/owner-walkthrough-harness/tools/packaging/test_packaging.py", line 90, in test_same_code_fixture_archive_errors_preserve_failed_receipt
self.assertEqual(type(error).__name__, case['exception'])
~~~~~~~~~~~~~~~~^^^^^^^^^^^^^^^^^^^^^^^^^^^^^^^^^^^^^^^^^
AssertionError: 'ValueError' != 'EOFError'
- ValueError
+ EOFError
======================================================================
FAIL: test_same_code_fixture_deb_tar_header_controls (test_packaging.PackageTests.test_same_code_fixture_deb_tar_header_controls)
----------------------------------------------------------------------
Traceback (most recent call last):
File "/run/media/kmosoti/data/FabricO11y/scratch/owner-walkthrough-harness/tools/packaging/test_packaging.py", line 105, in test_same_code_fixture_deb_tar_header_controls
self.assertTrue(callable(getattr(build_candidate_rpm, 'deb_headers', None)),
~~~~~~~~~~~~~~~^^^^^^^^^^^^^^^^^^^^^^^^^^^^^^^^^^^^^^^^^^^^^^^^^^^^^^^^^^^^^
'missing complete fixture Debian tar-header collector')
^^^^^^^^^^^^^^^^^^^^^^^^^^^^^^^^^^^^^^^^^^^^^^^^^^^^^^^
AssertionError: False is not true : missing complete fixture Debian tar-header collector
======================================================================
FAIL: test_same_code_fixture_rpm_provide_and_weak_dependency_controls (test_packaging.PackageTests.test_same_code_fixture_rpm_provide_and_weak_dependency_controls) (defect='additional-auto-provide-name')
----------------------------------------------------------------------
Traceback (most recent call last):
File "/run/media/kmosoti/data/FabricO11y/scratch/owner-walkthrough-harness/tools/packaging/test_packaging.py", line 164, in test_same_code_fixture_rpm_provide_and_weak_dependency_controls
self.assertNotEqual(actual, expected, 'unrelated native metadata drift was invisible')
~~~~~~~~~~~~~~~~~~~^^^^^^^^^^^^^^^^^^^^^^^^^^^^^^^^^^^^^^^^^^^^^^^^^^^^^^^^^^^^^^^^^^^
AssertionError: {'NAME': {'bytes': 56, 'sha256': '2f0993a222792b74aa07999149cea2a2dbeea2b76c3361a3b48cba7fdb321e6d'}, 'VERSION': {'bytes': 54, 'sha256': 'ef33f588574a201ecb793206f46894f246c64c7008bcd5adf03e7ba0b5f18165'}, 'ARCH': {'bytes': 52, 'sha256': '13516c1f42d33e65e15ff1ad533682b4c4fb88cfe65298cee87365c4edafdefa'}, 'FILEMODES': {'bytes': 87, 'sha256': '3b27d2ec5294ebd08eb903afde6544daba5ed20a18cdc864dfadf4c25ec3dd33'}, 'FILEUSERNAME': {'bytes': 85, 'sha256': 'caba8c4a831cf38718de5d0700990b6ea5b82002422ceff1da322881da798b78'}, 'FILEGROUPNAME': {'bytes': 86, 'sha256': '0d059a57f3681b5fdfec01f65799538ba8395210a92d17d2659bcc87db43d497'}} == {'NAME': {'bytes': 56, 'sha256': '2f0993a222792b74aa07999149cea2a2dbeea2b76c3361a3b48cba7fdb321e6d'}, 'VERSION': {'bytes': 54, 'sha256': 'ef33f588574a201ecb793206f46894f246c64c7008bcd5adf03e7ba0b5f18165'}, 'ARCH': {'bytes': 52, 'sha256': '13516c1f42d33e65e15ff1ad533682b4c4fb88cfe65298cee87365c4edafdefa'}, 'FILEMODES': {'bytes': 87, 'sha256': '3b27d2ec5294ebd08eb903afde6544daba5ed20a18cdc864dfadf4c25ec3dd33'}, 'FILEUSERNAME': {'bytes': 85, 'sha256': 'caba8c4a831cf38718de5d0700990b6ea5b82002422ceff1da322881da798b78'}, 'FILEGROUPNAME': {'bytes': 86, 'sha256': '0d059a57f3681b5fdfec01f65799538ba8395210a92d17d2659bcc87db43d497'}} : unrelated native metadata drift was invisible
======================================================================
FAIL: test_same_code_fixture_rpm_provide_and_weak_dependency_controls (test_packaging.PackageTests.test_same_code_fixture_rpm_provide_and_weak_dependency_controls) (defect='provide-flags')
----------------------------------------------------------------------
Traceback (most recent call last):
File "/run/media/kmosoti/data/FabricO11y/scratch/owner-walkthrough-harness/tools/packaging/test_packaging.py", line 164, in test_same_code_fixture_rpm_provide_and_weak_dependency_controls
self.assertNotEqual(actual, expected, 'unrelated native metadata drift was invisible')
~~~~~~~~~~~~~~~~~~~^^^^^^^^^^^^^^^^^^^^^^^^^^^^^^^^^^^^^^^^^^^^^^^^^^^^^^^^^^^^^^^^^^^
AssertionError: {'NAME': {'bytes': 56, 'sha256': '2f0993a222792b74aa07999149cea2a2dbeea2b76c3361a3b48cba7fdb321e6d'}, 'VERSION': {'bytes': 54, 'sha256': 'ef33f588574a201ecb793206f46894f246c64c7008bcd5adf03e7ba0b5f18165'}, 'ARCH': {'bytes': 52, 'sha256': '13516c1f42d33e65e15ff1ad533682b4c4fb88cfe65298cee87365c4edafdefa'}, 'FILEMODES': {'bytes': 87, 'sha256': '3b27d2ec5294ebd08eb903afde6544daba5ed20a18cdc864dfadf4c25ec3dd33'}, 'FILEUSERNAME': {'bytes': 85, 'sha256': 'caba8c4a831cf38718de5d0700990b6ea5b82002422ceff1da322881da798b78'}, 'FILEGROUPNAME': {'bytes': 86, 'sha256': '0d059a57f3681b5fdfec01f65799538ba8395210a92d17d2659bcc87db43d497'}} == {'NAME': {'bytes': 56, 'sha256': '2f0993a222792b74aa07999149cea2a2dbeea2b76c3361a3b48cba7fdb321e6d'}, 'VERSION': {'bytes': 54, 'sha256': 'ef33f588574a201ecb793206f46894f246c64c7008bcd5adf03e7ba0b5f18165'}, 'ARCH': {'bytes': 52, 'sha256': '13516c1f42d33e65e15ff1ad533682b4c4fb88cfe65298cee87365c4edafdefa'}, 'FILEMODES': {'bytes': 87, 'sha256': '3b27d2ec5294ebd08eb903afde6544daba5ed20a18cdc864dfadf4c25ec3dd33'}, 'FILEUSERNAME': {'bytes': 85, 'sha256': 'caba8c4a831cf38718de5d0700990b6ea5b82002422ceff1da322881da798b78'}, 'FILEGROUPNAME': {'bytes': 86, 'sha256': '0d059a57f3681b5fdfec01f65799538ba8395210a92d17d2659bcc87db43d497'}} : unrelated native metadata drift was invisible
======================================================================
FAIL: test_same_code_fixture_rpm_provide_and_weak_dependency_controls (test_packaging.PackageTests.test_same_code_fixture_rpm_provide_and_weak_dependency_controls) (defect='unexpected-self-provide-EVR')
----------------------------------------------------------------------
Traceback (most recent call last):
File "/run/media/kmosoti/data/FabricO11y/scratch/owner-walkthrough-harness/tools/packaging/test_packaging.py", line 164, in test_same_code_fixture_rpm_provide_and_weak_dependency_controls
self.assertNotEqual(actual, expected, 'unrelated native metadata drift was invisible')
~~~~~~~~~~~~~~~~~~~^^^^^^^^^^^^^^^^^^^^^^^^^^^^^^^^^^^^^^^^^^^^^^^^^^^^^^^^^^^^^^^^^^^
AssertionError: {'NAME': {'bytes': 56, 'sha256': '2f0993a222792b74aa07999149cea2a2dbeea2b76c3361a3b48cba7fdb321e6d'}, 'VERSION': {'bytes': 54, 'sha256': 'ef33f588574a201ecb793206f46894f246c64c7008bcd5adf03e7ba0b5f18165'}, 'ARCH': {'bytes': 52, 'sha256': '13516c1f42d33e65e15ff1ad533682b4c4fb88cfe65298cee87365c4edafdefa'}, 'FILEMODES': {'bytes': 87, 'sha256': '3b27d2ec5294ebd08eb903afde6544daba5ed20a18cdc864dfadf4c25ec3dd33'}, 'FILEUSERNAME': {'bytes': 85, 'sha256': 'caba8c4a831cf38718de5d0700990b6ea5b82002422ceff1da322881da798b78'}, 'FILEGROUPNAME': {'bytes': 86, 'sha256': '0d059a57f3681b5fdfec01f65799538ba8395210a92d17d2659bcc87db43d497'}} == {'NAME': {'bytes': 56, 'sha256': '2f0993a222792b74aa07999149cea2a2dbeea2b76c3361a3b48cba7fdb321e6d'}, 'VERSION': {'bytes': 54, 'sha256': 'ef33f588574a201ecb793206f46894f246c64c7008bcd5adf03e7ba0b5f18165'}, 'ARCH': {'bytes': 52, 'sha256': '13516c1f42d33e65e15ff1ad533682b4c4fb88cfe65298cee87365c4edafdefa'}, 'FILEMODES': {'bytes': 87, 'sha256': '3b27d2ec5294ebd08eb903afde6544daba5ed20a18cdc864dfadf4c25ec3dd33'}, 'FILEUSERNAME': {'bytes': 85, 'sha256': 'caba8c4a831cf38718de5d0700990b6ea5b82002422ceff1da322881da798b78'}, 'FILEGROUPNAME': {'bytes': 86, 'sha256': '0d059a57f3681b5fdfec01f65799538ba8395210a92d17d2659bcc87db43d497'}} : unrelated native metadata drift was invisible
======================================================================
FAIL: test_same_code_fixture_rpm_provide_and_weak_dependency_controls (test_packaging.PackageTests.test_same_code_fixture_rpm_provide_and_weak_dependency_controls) (defect='unrelated-provide-EVR')
----------------------------------------------------------------------
Traceback (most recent call last):
File "/run/media/kmosoti/data/FabricO11y/scratch/owner-walkthrough-harness/tools/packaging/test_packaging.py", line 164, in test_same_code_fixture_rpm_provide_and_weak_dependency_controls
self.assertNotEqual(actual, expected, 'unrelated native metadata drift was invisible')
~~~~~~~~~~~~~~~~~~~^^^^^^^^^^^^^^^^^^^^^^^^^^^^^^^^^^^^^^^^^^^^^^^^^^^^^^^^^^^^^^^^^^^
AssertionError: {'NAME': {'bytes': 56, 'sha256': '2f0993a222792b74aa07999149cea2a2dbeea2b76c3361a3b48cba7fdb321e6d'}, 'VERSION': {'bytes': 54, 'sha256': 'ef33f588574a201ecb793206f46894f246c64c7008bcd5adf03e7ba0b5f18165'}, 'ARCH': {'bytes': 52, 'sha256': '13516c1f42d33e65e15ff1ad533682b4c4fb88cfe65298cee87365c4edafdefa'}, 'FILEMODES': {'bytes': 87, 'sha256': '3b27d2ec5294ebd08eb903afde6544daba5ed20a18cdc864dfadf4c25ec3dd33'}, 'FILEUSERNAME': {'bytes': 85, 'sha256': 'caba8c4a831cf38718de5d0700990b6ea5b82002422ceff1da322881da798b78'}, 'FILEGROUPNAME': {'bytes': 86, 'sha256': '0d059a57f3681b5fdfec01f65799538ba8395210a92d17d2659bcc87db43d497'}} == {'NAME': {'bytes': 56, 'sha256': '2f0993a222792b74aa07999149cea2a2dbeea2b76c3361a3b48cba7fdb321e6d'}, 'VERSION': {'bytes': 54, 'sha256': 'ef33f588574a201ecb793206f46894f246c64c7008bcd5adf03e7ba0b5f18165'}, 'ARCH': {'bytes': 52, 'sha256': '13516c1f42d33e65e15ff1ad533682b4c4fb88cfe65298cee87365c4edafdefa'}, 'FILEMODES': {'bytes': 87, 'sha256': '3b27d2ec5294ebd08eb903afde6544daba5ed20a18cdc864dfadf4c25ec3dd33'}, 'FILEUSERNAME': {'bytes': 85, 'sha256': 'caba8c4a831cf38718de5d0700990b6ea5b82002422ceff1da322881da798b78'}, 'FILEGROUPNAME': {'bytes': 86, 'sha256': '0d059a57f3681b5fdfec01f65799538ba8395210a92d17d2659bcc87db43d497'}} : unrelated native metadata drift was invisible
======================================================================
FAIL: test_same_code_fixture_rpm_provide_and_weak_dependency_controls (test_packaging.PackageTests.test_same_code_fixture_rpm_provide_and_weak_dependency_controls) (defect='recommend-name')
----------------------------------------------------------------------
Traceback (most recent call last):
File "/run/media/kmosoti/data/FabricO11y/scratch/owner-walkthrough-harness/tools/packaging/test_packaging.py", line 164, in test_same_code_fixture_rpm_provide_and_weak_dependency_controls
self.assertNotEqual(actual, expected, 'unrelated native metadata drift was invisible')
~~~~~~~~~~~~~~~~~~~^^^^^^^^^^^^^^^^^^^^^^^^^^^^^^^^^^^^^^^^^^^^^^^^^^^^^^^^^^^^^^^^^^^
AssertionError: {'NAME': {'bytes': 56, 'sha256': '2f0993a222792b74aa07999149cea2a2dbeea2b76c3361a3b48cba7fdb321e6d'}, 'VERSION': {'bytes': 54, 'sha256': 'ef33f588574a201ecb793206f46894f246c64c7008bcd5adf03e7ba0b5f18165'}, 'ARCH': {'bytes': 52, 'sha256': '13516c1f42d33e65e15ff1ad533682b4c4fb88cfe65298cee87365c4edafdefa'}, 'FILEMODES': {'bytes': 87, 'sha256': '3b27d2ec5294ebd08eb903afde6544daba5ed20a18cdc864dfadf4c25ec3dd33'}, 'FILEUSERNAME': {'bytes': 85, 'sha256': 'caba8c4a831cf38718de5d0700990b6ea5b82002422ceff1da322881da798b78'}, 'FILEGROUPNAME': {'bytes': 86, 'sha256': '0d059a57f3681b5fdfec01f65799538ba8395210a92d17d2659bcc87db43d497'}} == {'NAME': {'bytes': 56, 'sha256': '2f0993a222792b74aa07999149cea2a2dbeea2b76c3361a3b48cba7fdb321e6d'}, 'VERSION': {'bytes': 54, 'sha256': 'ef33f588574a201ecb793206f46894f246c64c7008bcd5adf03e7ba0b5f18165'}, 'ARCH': {'bytes': 52, 'sha256': '13516c1f42d33e65e15ff1ad533682b4c4fb88cfe65298cee87365c4edafdefa'}, 'FILEMODES': {'bytes': 87, 'sha256': '3b27d2ec5294ebd08eb903afde6544daba5ed20a18cdc864dfadf4c25ec3dd33'}, 'FILEUSERNAME': {'bytes': 85, 'sha256': 'caba8c4a831cf38718de5d0700990b6ea5b82002422ceff1da322881da798b78'}, 'FILEGROUPNAME': {'bytes': 86, 'sha256': '0d059a57f3681b5fdfec01f65799538ba8395210a92d17d2659bcc87db43d497'}} : unrelated native metadata drift was invisible
======================================================================
FAIL: test_same_code_fixture_rpm_provide_and_weak_dependency_controls (test_packaging.PackageTests.test_same_code_fixture_rpm_provide_and_weak_dependency_controls) (defect='recommend-flags')
----------------------------------------------------------------------
Traceback (most recent call last):
File "/run/media/kmosoti/data/FabricO11y/scratch/owner-walkthrough-harness/tools/packaging/test_packaging.py", line 164, in test_same_code_fixture_rpm_provide_and_weak_dependency_controls
self.assertNotEqual(actual, expected, 'unrelated native metadata drift was invisible')
~~~~~~~~~~~~~~~~~~~^^^^^^^^^^^^^^^^^^^^^^^^^^^^^^^^^^^^^^^^^^^^^^^^^^^^^^^^^^^^^^^^^^^
AssertionError: {'NAME': {'bytes': 56, 'sha256': '2f0993a222792b74aa07999149cea2a2dbeea2b76c3361a3b48cba7fdb321e6d'}, 'VERSION': {'bytes': 54, 'sha256': 'ef33f588574a201ecb793206f46894f246c64c7008bcd5adf03e7ba0b5f18165'}, 'ARCH': {'bytes': 52, 'sha256': '13516c1f42d33e65e15ff1ad533682b4c4fb88cfe65298cee87365c4edafdefa'}, 'FILEMODES': {'bytes': 87, 'sha256': '3b27d2ec5294ebd08eb903afde6544daba5ed20a18cdc864dfadf4c25ec3dd33'}, 'FILEUSERNAME': {'bytes': 85, 'sha256': 'caba8c4a831cf38718de5d0700990b6ea5b82002422ceff1da322881da798b78'}, 'FILEGROUPNAME': {'bytes': 86, 'sha256': '0d059a57f3681b5fdfec01f65799538ba8395210a92d17d2659bcc87db43d497'}} == {'NAME': {'bytes': 56, 'sha256': '2f0993a222792b74aa07999149cea2a2dbeea2b76c3361a3b48cba7fdb321e6d'}, 'VERSION': {'bytes': 54, 'sha256': 'ef33f588574a201ecb793206f46894f246c64c7008bcd5adf03e7ba0b5f18165'}, 'ARCH': {'bytes': 52, 'sha256': '13516c1f42d33e65e15ff1ad533682b4c4fb88cfe65298cee87365c4edafdefa'}, 'FILEMODES': {'bytes': 87, 'sha256': '3b27d2ec5294ebd08eb903afde6544daba5ed20a18cdc864dfadf4c25ec3dd33'}, 'FILEUSERNAME': {'bytes': 85, 'sha256': 'caba8c4a831cf38718de5d0700990b6ea5b82002422ceff1da322881da798b78'}, 'FILEGROUPNAME': {'bytes': 86, 'sha256': '0d059a57f3681b5fdfec01f65799538ba8395210a92d17d2659bcc87db43d497'}} : unrelated native metadata drift was invisible
======================================================================
FAIL: test_same_code_fixture_rpm_provide_and_weak_dependency_controls (test_packaging.PackageTests.test_same_code_fixture_rpm_provide_and_weak_dependency_controls) (defect='recommend-version')
----------------------------------------------------------------------
Traceback (most recent call last):
File "/run/media/kmosoti/data/FabricO11y/scratch/owner-walkthrough-harness/tools/packaging/test_packaging.py", line 164, in test_same_code_fixture_rpm_provide_and_weak_dependency_controls
self.assertNotEqual(actual, expected, 'unrelated native metadata drift was invisible')
~~~~~~~~~~~~~~~~~~~^^^^^^^^^^^^^^^^^^^^^^^^^^^^^^^^^^^^^^^^^^^^^^^^^^^^^^^^^^^^^^^^^^^
AssertionError: {'NAME': {'bytes': 56, 'sha256': '2f0993a222792b74aa07999149cea2a2dbeea2b76c3361a3b48cba7fdb321e6d'}, 'VERSION': {'bytes': 54, 'sha256': 'ef33f588574a201ecb793206f46894f246c64c7008bcd5adf03e7ba0b5f18165'}, 'ARCH': {'bytes': 52, 'sha256': '13516c1f42d33e65e15ff1ad533682b4c4fb88cfe65298cee87365c4edafdefa'}, 'FILEMODES': {'bytes': 87, 'sha256': '3b27d2ec5294ebd08eb903afde6544daba5ed20a18cdc864dfadf4c25ec3dd33'}, 'FILEUSERNAME': {'bytes': 85, 'sha256': 'caba8c4a831cf38718de5d0700990b6ea5b82002422ceff1da322881da798b78'}, 'FILEGROUPNAME': {'bytes': 86, 'sha256': '0d059a57f3681b5fdfec01f65799538ba8395210a92d17d2659bcc87db43d497'}} == {'NAME': {'bytes': 56, 'sha256': '2f0993a222792b74aa07999149cea2a2dbeea2b76c3361a3b48cba7fdb321e6d'}, 'VERSION': {'bytes': 54, 'sha256': 'ef33f588574a201ecb793206f46894f246c64c7008bcd5adf03e7ba0b5f18165'}, 'ARCH': {'bytes': 52, 'sha256': '13516c1f42d33e65e15ff1ad533682b4c4fb88cfe65298cee87365c4edafdefa'}, 'FILEMODES': {'bytes': 87, 'sha256': '3b27d2ec5294ebd08eb903afde6544daba5ed20a18cdc864dfadf4c25ec3dd33'}, 'FILEUSERNAME': {'bytes': 85, 'sha256': 'caba8c4a831cf38718de5d0700990b6ea5b82002422ceff1da322881da798b78'}, 'FILEGROUPNAME': {'bytes': 86, 'sha256': '0d059a57f3681b5fdfec01f65799538ba8395210a92d17d2659bcc87db43d497'}} : unrelated native metadata drift was invisible
======================================================================
FAIL: test_same_code_fixture_rpm_provide_and_weak_dependency_controls (test_packaging.PackageTests.test_same_code_fixture_rpm_provide_and_weak_dependency_controls) (defect='suggest-name')
----------------------------------------------------------------------
Traceback (most recent call last):
File "/run/media/kmosoti/data/FabricO11y/scratch/owner-walkthrough-harness/tools/packaging/test_packaging.py", line 164, in test_same_code_fixture_rpm_provide_and_weak_dependency_controls
self.assertNotEqual(actual, expected, 'unrelated native metadata drift was invisible')
~~~~~~~~~~~~~~~~~~~^^^^^^^^^^^^^^^^^^^^^^^^^^^^^^^^^^^^^^^^^^^^^^^^^^^^^^^^^^^^^^^^^^^
AssertionError: {'NAME': {'bytes': 56, 'sha256': '2f0993a222792b74aa07999149cea2a2dbeea2b76c3361a3b48cba7fdb321e6d'}, 'VERSION': {'bytes': 54, 'sha256': 'ef33f588574a201ecb793206f46894f246c64c7008bcd5adf03e7ba0b5f18165'}, 'ARCH': {'bytes': 52, 'sha256': '13516c1f42d33e65e15ff1ad533682b4c4fb88cfe65298cee87365c4edafdefa'}, 'FILEMODES': {'bytes': 87, 'sha256': '3b27d2ec5294ebd08eb903afde6544daba5ed20a18cdc864dfadf4c25ec3dd33'}, 'FILEUSERNAME': {'bytes': 85, 'sha256': 'caba8c4a831cf38718de5d0700990b6ea5b82002422ceff1da322881da798b78'}, 'FILEGROUPNAME': {'bytes': 86, 'sha256': '0d059a57f3681b5fdfec01f65799538ba8395210a92d17d2659bcc87db43d497'}} == {'NAME': {'bytes': 56, 'sha256': '2f0993a222792b74aa07999149cea2a2dbeea2b76c3361a3b48cba7fdb321e6d'}, 'VERSION': {'bytes': 54, 'sha256': 'ef33f588574a201ecb793206f46894f246c64c7008bcd5adf03e7ba0b5f18165'}, 'ARCH': {'bytes': 52, 'sha256': '13516c1f42d33e65e15ff1ad533682b4c4fb88cfe65298cee87365c4edafdefa'}, 'FILEMODES': {'bytes': 87, 'sha256': '3b27d2ec5294ebd08eb903afde6544daba5ed20a18cdc864dfadf4c25ec3dd33'}, 'FILEUSERNAME': {'bytes': 85, 'sha256': 'caba8c4a831cf38718de5d0700990b6ea5b82002422ceff1da322881da798b78'}, 'FILEGROUPNAME': {'bytes': 86, 'sha256': '0d059a57f3681b5fdfec01f65799538ba8395210a92d17d2659bcc87db43d497'}} : unrelated native metadata drift was invisible
======================================================================
FAIL: test_same_code_fixture_rpm_provide_and_weak_dependency_controls (test_packaging.PackageTests.test_same_code_fixture_rpm_provide_and_weak_dependency_controls) (defect='suggest-flags')
----------------------------------------------------------------------
Traceback (most recent call last):
File "/run/media/kmosoti/data/FabricO11y/scratch/owner-walkthrough-harness/tools/packaging/test_packaging.py", line 164, in test_same_code_fixture_rpm_provide_and_weak_dependency_controls
self.assertNotEqual(actual, expected, 'unrelated native metadata drift was invisible')
~~~~~~~~~~~~~~~~~~~^^^^^^^^^^^^^^^^^^^^^^^^^^^^^^^^^^^^^^^^^^^^^^^^^^^^^^^^^^^^^^^^^^^
AssertionError: {'NAME': {'bytes': 56, 'sha256': '2f0993a222792b74aa07999149cea2a2dbeea2b76c3361a3b48cba7fdb321e6d'}, 'VERSION': {'bytes': 54, 'sha256': 'ef33f588574a201ecb793206f46894f246c64c7008bcd5adf03e7ba0b5f18165'}, 'ARCH': {'bytes': 52, 'sha256': '13516c1f42d33e65e15ff1ad533682b4c4fb88cfe65298cee87365c4edafdefa'}, 'FILEMODES': {'bytes': 87, 'sha256': '3b27d2ec5294ebd08eb903afde6544daba5ed20a18cdc864dfadf4c25ec3dd33'}, 'FILEUSERNAME': {'bytes': 85, 'sha256': 'caba8c4a831cf38718de5d0700990b6ea5b82002422ceff1da322881da798b78'}, 'FILEGROUPNAME': {'bytes': 86, 'sha256': '0d059a57f3681b5fdfec01f65799538ba8395210a92d17d2659bcc87db43d497'}} == {'NAME': {'bytes': 56, 'sha256': '2f0993a222792b74aa07999149cea2a2dbeea2b76c3361a3b48cba7fdb321e6d'}, 'VERSION': {'bytes': 54, 'sha256': 'ef33f588574a201ecb793206f46894f246c64c7008bcd5adf03e7ba0b5f18165'}, 'ARCH': {'bytes': 52, 'sha256': '13516c1f42d33e65e15ff1ad533682b4c4fb88cfe65298cee87365c4edafdefa'}, 'FILEMODES': {'bytes': 87, 'sha256': '3b27d2ec5294ebd08eb903afde6544daba5ed20a18cdc864dfadf4c25ec3dd33'}, 'FILEUSERNAME': {'bytes': 85, 'sha256': 'caba8c4a831cf38718de5d0700990b6ea5b82002422ceff1da322881da798b78'}, 'FILEGROUPNAME': {'bytes': 86, 'sha256': '0d059a57f3681b5fdfec01f65799538ba8395210a92d17d2659bcc87db43d497'}} : unrelated native metadata drift was invisible
======================================================================
FAIL: test_same_code_fixture_rpm_provide_and_weak_dependency_controls (test_packaging.PackageTests.test_same_code_fixture_rpm_provide_and_weak_dependency_controls) (defect='suggest-version')
----------------------------------------------------------------------
Traceback (most recent call last):
File "/run/media/kmosoti/data/FabricO11y/scratch/owner-walkthrough-harness/tools/packaging/test_packaging.py", line 164, in test_same_code_fixture_rpm_provide_and_weak_dependency_controls
self.assertNotEqual(actual, expected, 'unrelated native metadata drift was invisible')
~~~~~~~~~~~~~~~~~~~^^^^^^^^^^^^^^^^^^^^^^^^^^^^^^^^^^^^^^^^^^^^^^^^^^^^^^^^^^^^^^^^^^^
AssertionError: {'NAME': {'bytes': 56, 'sha256': '2f0993a222792b74aa07999149cea2a2dbeea2b76c3361a3b48cba7fdb321e6d'}, 'VERSION': {'bytes': 54, 'sha256': 'ef33f588574a201ecb793206f46894f246c64c7008bcd5adf03e7ba0b5f18165'}, 'ARCH': {'bytes': 52, 'sha256': '13516c1f42d33e65e15ff1ad533682b4c4fb88cfe65298cee87365c4edafdefa'}, 'FILEMODES': {'bytes': 87, 'sha256': '3b27d2ec5294ebd08eb903afde6544daba5ed20a18cdc864dfadf4c25ec3dd33'}, 'FILEUSERNAME': {'bytes': 85, 'sha256': 'caba8c4a831cf38718de5d0700990b6ea5b82002422ceff1da322881da798b78'}, 'FILEGROUPNAME': {'bytes': 86, 'sha256': '0d059a57f3681b5fdfec01f65799538ba8395210a92d17d2659bcc87db43d497'}} == {'NAME': {'bytes': 56, 'sha256': '2f0993a222792b74aa07999149cea2a2dbeea2b76c3361a3b48cba7fdb321e6d'}, 'VERSION': {'bytes': 54, 'sha256': 'ef33f588574a201ecb793206f46894f246c64c7008bcd5adf03e7ba0b5f18165'}, 'ARCH': {'bytes': 52, 'sha256': '13516c1f42d33e65e15ff1ad533682b4c4fb88cfe65298cee87365c4edafdefa'}, 'FILEMODES': {'bytes': 87, 'sha256': '3b27d2ec5294ebd08eb903afde6544daba5ed20a18cdc864dfadf4c25ec3dd33'}, 'FILEUSERNAME': {'bytes': 85, 'sha256': 'caba8c4a831cf38718de5d0700990b6ea5b82002422ceff1da322881da798b78'}, 'FILEGROUPNAME': {'bytes': 86, 'sha256': '0d059a57f3681b5fdfec01f65799538ba8395210a92d17d2659bcc87db43d497'}} : unrelated native metadata drift was invisible
======================================================================
FAIL: test_same_code_fixture_rpm_provide_and_weak_dependency_controls (test_packaging.PackageTests.test_same_code_fixture_rpm_provide_and_weak_dependency_controls) (defect='supplement-name')
----------------------------------------------------------------------
Traceback (most recent call last):
File "/run/media/kmosoti/data/FabricO11y/scratch/owner-walkthrough-harness/tools/packaging/test_packaging.py", line 164, in test_same_code_fixture_rpm_provide_and_weak_dependency_controls
self.assertNotEqual(actual, expected, 'unrelated native metadata drift was invisible')
~~~~~~~~~~~~~~~~~~~^^^^^^^^^^^^^^^^^^^^^^^^^^^^^^^^^^^^^^^^^^^^^^^^^^^^^^^^^^^^^^^^^^^
AssertionError: {'NAME': {'bytes': 56, 'sha256': '2f0993a222792b74aa07999149cea2a2dbeea2b76c3361a3b48cba7fdb321e6d'}, 'VERSION': {'bytes': 54, 'sha256': 'ef33f588574a201ecb793206f46894f246c64c7008bcd5adf03e7ba0b5f18165'}, 'ARCH': {'bytes': 52, 'sha256': '13516c1f42d33e65e15ff1ad533682b4c4fb88cfe65298cee87365c4edafdefa'}, 'FILEMODES': {'bytes': 87, 'sha256': '3b27d2ec5294ebd08eb903afde6544daba5ed20a18cdc864dfadf4c25ec3dd33'}, 'FILEUSERNAME': {'bytes': 85, 'sha256': 'caba8c4a831cf38718de5d0700990b6ea5b82002422ceff1da322881da798b78'}, 'FILEGROUPNAME': {'bytes': 86, 'sha256': '0d059a57f3681b5fdfec01f65799538ba8395210a92d17d2659bcc87db43d497'}} == {'NAME': {'bytes': 56, 'sha256': '2f0993a222792b74aa07999149cea2a2dbeea2b76c3361a3b48cba7fdb321e6d'}, 'VERSION': {'bytes': 54, 'sha256': 'ef33f588574a201ecb793206f46894f246c64c7008bcd5adf03e7ba0b5f18165'}, 'ARCH': {'bytes': 52, 'sha256': '13516c1f42d33e65e15ff1ad533682b4c4fb88cfe65298cee87365c4edafdefa'}, 'FILEMODES': {'bytes': 87, 'sha256': '3b27d2ec5294ebd08eb903afde6544daba5ed20a18cdc864dfadf4c25ec3dd33'}, 'FILEUSERNAME': {'bytes': 85, 'sha256': 'caba8c4a831cf38718de5d0700990b6ea5b82002422ceff1da322881da798b78'}, 'FILEGROUPNAME': {'bytes': 86, 'sha256': '0d059a57f3681b5fdfec01f65799538ba8395210a92d17d2659bcc87db43d497'}} : unrelated native metadata drift was invisible
======================================================================
FAIL: test_same_code_fixture_rpm_provide_and_weak_dependency_controls (test_packaging.PackageTests.test_same_code_fixture_rpm_provide_and_weak_dependency_controls) (defect='supplement-flags')
----------------------------------------------------------------------
Traceback (most recent call last):
File "/run/media/kmosoti/data/FabricO11y/scratch/owner-walkthrough-harness/tools/packaging/test_packaging.py", line 164, in test_same_code_fixture_rpm_provide_and_weak_dependency_controls
self.assertNotEqual(actual, expected, 'unrelated native metadata drift was invisible')
~~~~~~~~~~~~~~~~~~~^^^^^^^^^^^^^^^^^^^^^^^^^^^^^^^^^^^^^^^^^^^^^^^^^^^^^^^^^^^^^^^^^^^
AssertionError: {'NAME': {'bytes': 56, 'sha256': '2f0993a222792b74aa07999149cea2a2dbeea2b76c3361a3b48cba7fdb321e6d'}, 'VERSION': {'bytes': 54, 'sha256': 'ef33f588574a201ecb793206f46894f246c64c7008bcd5adf03e7ba0b5f18165'}, 'ARCH': {'bytes': 52, 'sha256': '13516c1f42d33e65e15ff1ad533682b4c4fb88cfe65298cee87365c4edafdefa'}, 'FILEMODES': {'bytes': 87, 'sha256': '3b27d2ec5294ebd08eb903afde6544daba5ed20a18cdc864dfadf4c25ec3dd33'}, 'FILEUSERNAME': {'bytes': 85, 'sha256': 'caba8c4a831cf38718de5d0700990b6ea5b82002422ceff1da322881da798b78'}, 'FILEGROUPNAME': {'bytes': 86, 'sha256': '0d059a57f3681b5fdfec01f65799538ba8395210a92d17d2659bcc87db43d497'}} == {'NAME': {'bytes': 56, 'sha256': '2f0993a222792b74aa07999149cea2a2dbeea2b76c3361a3b48cba7fdb321e6d'}, 'VERSION': {'bytes': 54, 'sha256': 'ef33f588574a201ecb793206f46894f246c64c7008bcd5adf03e7ba0b5f18165'}, 'ARCH': {'bytes': 52, 'sha256': '13516c1f42d33e65e15ff1ad533682b4c4fb88cfe65298cee87365c4edafdefa'}, 'FILEMODES': {'bytes': 87, 'sha256': '3b27d2ec5294ebd08eb903afde6544daba5ed20a18cdc864dfadf4c25ec3dd33'}, 'FILEUSERNAME': {'bytes': 85, 'sha256': 'caba8c4a831cf38718de5d0700990b6ea5b82002422ceff1da322881da798b78'}, 'FILEGROUPNAME': {'bytes': 86, 'sha256': '0d059a57f3681b5fdfec01f65799538ba8395210a92d17d2659bcc87db43d497'}} : unrelated native metadata drift was invisible
======================================================================
FAIL: test_same_code_fixture_rpm_provide_and_weak_dependency_controls (test_packaging.PackageTests.test_same_code_fixture_rpm_provide_and_weak_dependency_controls) (defect='supplement-version')
----------------------------------------------------------------------
Traceback (most recent call last):
File "/run/media/kmosoti/data/FabricO11y/scratch/owner-walkthrough-harness/tools/packaging/test_packaging.py", line 164, in test_same_code_fixture_rpm_provide_and_weak_dependency_controls
self.assertNotEqual(actual, expected, 'unrelated native metadata drift was invisible')
~~~~~~~~~~~~~~~~~~~^^^^^^^^^^^^^^^^^^^^^^^^^^^^^^^^^^^^^^^^^^^^^^^^^^^^^^^^^^^^^^^^^^^
AssertionError: {'NAME': {'bytes': 56, 'sha256': '2f0993a222792b74aa07999149cea2a2dbeea2b76c3361a3b48cba7fdb321e6d'}, 'VERSION': {'bytes': 54, 'sha256': 'ef33f588574a201ecb793206f46894f246c64c7008bcd5adf03e7ba0b5f18165'}, 'ARCH': {'bytes': 52, 'sha256': '13516c1f42d33e65e15ff1ad533682b4c4fb88cfe65298cee87365c4edafdefa'}, 'FILEMODES': {'bytes': 87, 'sha256': '3b27d2ec5294ebd08eb903afde6544daba5ed20a18cdc864dfadf4c25ec3dd33'}, 'FILEUSERNAME': {'bytes': 85, 'sha256': 'caba8c4a831cf38718de5d0700990b6ea5b82002422ceff1da322881da798b78'}, 'FILEGROUPNAME': {'bytes': 86, 'sha256': '0d059a57f3681b5fdfec01f65799538ba8395210a92d17d2659bcc87db43d497'}} == {'NAME': {'bytes': 56, 'sha256': '2f0993a222792b74aa07999149cea2a2dbeea2b76c3361a3b48cba7fdb321e6d'}, 'VERSION': {'bytes': 54, 'sha256': 'ef33f588574a201ecb793206f46894f246c64c7008bcd5adf03e7ba0b5f18165'}, 'ARCH': {'bytes': 52, 'sha256': '13516c1f42d33e65e15ff1ad533682b4c4fb88cfe65298cee87365c4edafdefa'}, 'FILEMODES': {'bytes': 87, 'sha256': '3b27d2ec5294ebd08eb903afde6544daba5ed20a18cdc864dfadf4c25ec3dd33'}, 'FILEUSERNAME': {'bytes': 85, 'sha256': 'caba8c4a831cf38718de5d0700990b6ea5b82002422ceff1da322881da798b78'}, 'FILEGROUPNAME': {'bytes': 86, 'sha256': '0d059a57f3681b5fdfec01f65799538ba8395210a92d17d2659bcc87db43d497'}} : unrelated native metadata drift was invisible
======================================================================
FAIL: test_same_code_fixture_rpm_provide_and_weak_dependency_controls (test_packaging.PackageTests.test_same_code_fixture_rpm_provide_and_weak_dependency_controls) (defect='enhance-name')
----------------------------------------------------------------------
Traceback (most recent call last):
File "/run/media/kmosoti/data/FabricO11y/scratch/owner-walkthrough-harness/tools/packaging/test_packaging.py", line 164, in test_same_code_fixture_rpm_provide_and_weak_dependency_controls
self.assertNotEqual(actual, expected, 'unrelated native metadata drift was invisible')
~~~~~~~~~~~~~~~~~~~^^^^^^^^^^^^^^^^^^^^^^^^^^^^^^^^^^^^^^^^^^^^^^^^^^^^^^^^^^^^^^^^^^^
AssertionError: {'NAME': {'bytes': 56, 'sha256': '2f0993a222792b74aa07999149cea2a2dbeea2b76c3361a3b48cba7fdb321e6d'}, 'VERSION': {'bytes': 54, 'sha256': 'ef33f588574a201ecb793206f46894f246c64c7008bcd5adf03e7ba0b5f18165'}, 'ARCH': {'bytes': 52, 'sha256': '13516c1f42d33e65e15ff1ad533682b4c4fb88cfe65298cee87365c4edafdefa'}, 'FILEMODES': {'bytes': 87, 'sha256': '3b27d2ec5294ebd08eb903afde6544daba5ed20a18cdc864dfadf4c25ec3dd33'}, 'FILEUSERNAME': {'bytes': 85, 'sha256': 'caba8c4a831cf38718de5d0700990b6ea5b82002422ceff1da322881da798b78'}, 'FILEGROUPNAME': {'bytes': 86, 'sha256': '0d059a57f3681b5fdfec01f65799538ba8395210a92d17d2659bcc87db43d497'}} == {'NAME': {'bytes': 56, 'sha256': '2f0993a222792b74aa07999149cea2a2dbeea2b76c3361a3b48cba7fdb321e6d'}, 'VERSION': {'bytes': 54, 'sha256': 'ef33f588574a201ecb793206f46894f246c64c7008bcd5adf03e7ba0b5f18165'}, 'ARCH': {'bytes': 52, 'sha256': '13516c1f42d33e65e15ff1ad533682b4c4fb88cfe65298cee87365c4edafdefa'}, 'FILEMODES': {'bytes': 87, 'sha256': '3b27d2ec5294ebd08eb903afde6544daba5ed20a18cdc864dfadf4c25ec3dd33'}, 'FILEUSERNAME': {'bytes': 85, 'sha256': 'caba8c4a831cf38718de5d0700990b6ea5b82002422ceff1da322881da798b78'}, 'FILEGROUPNAME': {'bytes': 86, 'sha256': '0d059a57f3681b5fdfec01f65799538ba8395210a92d17d2659bcc87db43d497'}} : unrelated native metadata drift was invisible
======================================================================
FAIL: test_same_code_fixture_rpm_provide_and_weak_dependency_controls (test_packaging.PackageTests.test_same_code_fixture_rpm_provide_and_weak_dependency_controls) (defect='enhance-flags')
----------------------------------------------------------------------
Traceback (most recent call last):
File "/run/media/kmosoti/data/FabricO11y/scratch/owner-walkthrough-harness/tools/packaging/test_packaging.py", line 164, in test_same_code_fixture_rpm_provide_and_weak_dependency_controls
self.assertNotEqual(actual, expected, 'unrelated native metadata drift was invisible')
~~~~~~~~~~~~~~~~~~~^^^^^^^^^^^^^^^^^^^^^^^^^^^^^^^^^^^^^^^^^^^^^^^^^^^^^^^^^^^^^^^^^^^
AssertionError: {'NAME': {'bytes': 56, 'sha256': '2f0993a222792b74aa07999149cea2a2dbeea2b76c3361a3b48cba7fdb321e6d'}, 'VERSION': {'bytes': 54, 'sha256': 'ef33f588574a201ecb793206f46894f246c64c7008bcd5adf03e7ba0b5f18165'}, 'ARCH': {'bytes': 52, 'sha256': '13516c1f42d33e65e15ff1ad533682b4c4fb88cfe65298cee87365c4edafdefa'}, 'FILEMODES': {'bytes': 87, 'sha256': '3b27d2ec5294ebd08eb903afde6544daba5ed20a18cdc864dfadf4c25ec3dd33'}, 'FILEUSERNAME': {'bytes': 85, 'sha256': 'caba8c4a831cf38718de5d0700990b6ea5b82002422ceff1da322881da798b78'}, 'FILEGROUPNAME': {'bytes': 86, 'sha256': '0d059a57f3681b5fdfec01f65799538ba8395210a92d17d2659bcc87db43d497'}} == {'NAME': {'bytes': 56, 'sha256': '2f0993a222792b74aa07999149cea2a2dbeea2b76c3361a3b48cba7fdb321e6d'}, 'VERSION': {'bytes': 54, 'sha256': 'ef33f588574a201ecb793206f46894f246c64c7008bcd5adf03e7ba0b5f18165'}, 'ARCH': {'bytes': 52, 'sha256': '13516c1f42d33e65e15ff1ad533682b4c4fb88cfe65298cee87365c4edafdefa'}, 'FILEMODES': {'bytes': 87, 'sha256': '3b27d2ec5294ebd08eb903afde6544daba5ed20a18cdc864dfadf4c25ec3dd33'}, 'FILEUSERNAME': {'bytes': 85, 'sha256': 'caba8c4a831cf38718de5d0700990b6ea5b82002422ceff1da322881da798b78'}, 'FILEGROUPNAME': {'bytes': 86, 'sha256': '0d059a57f3681b5fdfec01f65799538ba8395210a92d17d2659bcc87db43d497'}} : unrelated native metadata drift was invisible
======================================================================
FAIL: test_same_code_fixture_rpm_provide_and_weak_dependency_controls (test_packaging.PackageTests.test_same_code_fixture_rpm_provide_and_weak_dependency_controls) (defect='enhance-version')
----------------------------------------------------------------------
Traceback (most recent call last):
File "/run/media/kmosoti/data/FabricO11y/scratch/owner-walkthrough-harness/tools/packaging/test_packaging.py", line 164, in test_same_code_fixture_rpm_provide_and_weak_dependency_controls
self.assertNotEqual(actual, expected, 'unrelated native metadata drift was invisible')
~~~~~~~~~~~~~~~~~~~^^^^^^^^^^^^^^^^^^^^^^^^^^^^^^^^^^^^^^^^^^^^^^^^^^^^^^^^^^^^^^^^^^^
AssertionError: {'NAME': {'bytes': 56, 'sha256': '2f0993a222792b74aa07999149cea2a2dbeea2b76c3361a3b48cba7fdb321e6d'}, 'VERSION': {'bytes': 54, 'sha256': 'ef33f588574a201ecb793206f46894f246c64c7008bcd5adf03e7ba0b5f18165'}, 'ARCH': {'bytes': 52, 'sha256': '13516c1f42d33e65e15ff1ad533682b4c4fb88cfe65298cee87365c4edafdefa'}, 'FILEMODES': {'bytes': 87, 'sha256': '3b27d2ec5294ebd08eb903afde6544daba5ed20a18cdc864dfadf4c25ec3dd33'}, 'FILEUSERNAME': {'bytes': 85, 'sha256': 'caba8c4a831cf38718de5d0700990b6ea5b82002422ceff1da322881da798b78'}, 'FILEGROUPNAME': {'bytes': 86, 'sha256': '0d059a57f3681b5fdfec01f65799538ba8395210a92d17d2659bcc87db43d497'}} == {'NAME': {'bytes': 56, 'sha256': '2f0993a222792b74aa07999149cea2a2dbeea2b76c3361a3b48cba7fdb321e6d'}, 'VERSION': {'bytes': 54, 'sha256': 'ef33f588574a201ecb793206f46894f246c64c7008bcd5adf03e7ba0b5f18165'}, 'ARCH': {'bytes': 52, 'sha256': '13516c1f42d33e65e15ff1ad533682b4c4fb88cfe65298cee87365c4edafdefa'}, 'FILEMODES': {'bytes': 87, 'sha256': '3b27d2ec5294ebd08eb903afde6544daba5ed20a18cdc864dfadf4c25ec3dd33'}, 'FILEUSERNAME': {'bytes': 85, 'sha256': 'caba8c4a831cf38718de5d0700990b6ea5b82002422ceff1da322881da798b78'}, 'FILEGROUPNAME': {'bytes': 86, 'sha256': '0d059a57f3681b5fdfec01f65799538ba8395210a92d17d2659bcc87db43d497'}} : unrelated native metadata drift was invisible
======================================================================
FAIL: test_extraction_failure_retains_stderr_and_command (test_payload.PayloadTests.test_extraction_failure_retains_stderr_and_command)
----------------------------------------------------------------------
Traceback (most recent call last):
File "/run/media/kmosoti/data/FabricO11y/scratch/owner-walkthrough-harness/tools/packaging/test_payload.py", line 25, in test_extraction_failure_retains_stderr_and_command
self.assertIn('literal archive diagnostic', str(caught.exception))
~~~~~~~~~~~~~^^^^^^^^^^^^^^^^^^^^^^^^^^^^^^^^^^^^^^^^^^^^^^^^^^^^^
AssertionError: 'literal archive diagnostic' not found in 'payload extraction failed'
----------------------------------------------------------------------
Ran 4 tests in 0.031s
FAILED (failures=22)
Finished with result: exit-code
Main processes terminated with: code=exited, status=1/FAILURE
Service runtime: 218ms
CPU time consumed: 169ms
Memory peak: 27.7M (swap: 0B)
Resource receipt SHA256 7e95982209fab8f8c7da8326f279dbe63fbef9069d47c2a4cd02a899313b3acd.
{
"unit": "fabric-work-c9b894bb280b4b6fb502b3a5953462d8",
"command": [
"env",
"PYTHONPATH=/run/media/kmosoti/data/FabricO11y/scratch/owner-walkthrough-harness/tools/packaging",
"python3",
"-B",
"-m",
"unittest",
"test_packaging.PackageTests.test_same_code_fixture_archive_errors_preserve_failed_receipt",
"test_packaging.PackageTests.test_same_code_fixture_deb_tar_header_controls",
"test_packaging.PackageTests.test_same_code_fixture_rpm_provide_and_weak_dependency_controls",
"test_payload.PayloadTests.test_extraction_failure_retains_stderr_and_command"
],
"exit": 1,
"wrapper_exit": 1,
"command_receipt": {
"unit": "fabric-work-c9b894bb280b4b6fb502b3a5953462d8",
"command": [
"env",
"PYTHONPATH=/run/media/kmosoti/data/FabricO11y/scratch/owner-walkthrough-harness/tools/packaging",
"python3",
"-B",
"-m",
"unittest",
"test_packaging.PackageTests.test_same_code_fixture_archive_errors_preserve_failed_receipt",
"test_packaging.PackageTests.test_same_code_fixture_deb_tar_header_controls",
"test_packaging.PackageTests.test_same_code_fixture_rpm_provide_and_weak_dependency_controls",
"test_payload.PayloadTests.test_extraction_failure_retains_stderr_and_command"
],
"cgroup": "/sys/fs/cgroup/user.slice/user-1000.slice/[email protected]/app.slice/fabric-work-c9b894bb280b4b6fb502b3a5953462d8.service",
"state": "completed",
"exit": 1,
"resource_observation": "command_return_before_service_stop",
"resources": {
"memory.peak": "29057024",
"memory.events": "low 0\nhigh 0\nmax 0\noom 0\noom_kill 0\noom_group_kill 0\nsock_throttled 0",
"cpu.stat": "usage_usec 163626\nuser_usec 142857\nsystem_usec 20768\nnice_usec 0\ncore_sched.force_idle_usec 0\nnr_periods 0\nnr_throttled 0\nthrottled_usec 0\nnr_bursts 0\nburst_usec 0"
}
},
"stop_confirmed": true,
"stop_error": null,
"started_unix": 1791853479.8210986,
"elapsed_s": 0.23349785804748535,
"storage_root": "/run/media/kmosoti/data/FabricO11y",
"temporary": "/run/media/kmosoti/data/FabricO11y/scratch/work-klt98tar",
"temporary_removed": true,
"retained_failure_evidence": "/run/media/kmosoti/data/FabricO11y/evidence/fabric-work-c9b894bb280b4b6fb502b3a5953462d8",
"memory_high_bytes": 17179869184,
"memory_max_bytes": 21474836480,
"swap_max_bytes": 0,
"runtime_max_seconds": 1800,
"delegated": false
}
owner-walkthrough-fixture-archive-counterexample-red-02
Outer record SHA256 5be3fbd4610e313e7a3927776f85026e66f61d57da48198db89c5c9be23638dc.
{
"label": "owner-walkthrough-fixture-archive-counterexample-red-02",
"command": [
"env",
"PYTHONPATH=/run/media/kmosoti/data/FabricO11y/scratch/owner-fixture-archive-counterexample/tools/packaging",
"python3",
"-B",
"-m",
"unittest",
"test_packaging.PackageTests.test_same_code_fixture_archive_errors_preserve_failed_receipt"
],
"delegated": false,
"frozen": null,
"scope": "harness controls only; no candidate acceptance evidence",
"harness_revision": "4e58b94c6f4afc6f63ee9e51b6f7d9903c32f5f8",
"source_status_before": "",
"storage_root": "/run/media/kmosoti/data/FabricO11y",
"admission_bytes": 89258911914,
"admission_observation": {
"data_bytes": 89258911914,
"regular_path_bytes": 89258876657,
"path_count": 451749,
"uid": 0,
"gid": 0,
"attempt": 1
},
"reserved_bytes": 1073741824,
"observations": [],
"started_utc": "2026-10-13T01:34:29.015785+00:00",
"state": "completed",
"log": "/run/media/kmosoti/data/FabricO11y/results/service-opening-candidate/owner-walkthrough-fixture-archive-counterexample-red-02.log",
"launcher_exit": 1,
"exit": 1,
"source_status_after": "",
"finished_utc": "2026-10-13T01:34:30.021261+00:00",
"log_sha256": "97dca23a1cfb1ab3037554b4222c8e40e72e4db515337daed4dd8ed896bef479",
"resource_receipts": [
{
"path": "/run/media/kmosoti/data/FabricO11y/results/service-opening-candidate/resource-containment/fabric-work-63ce04ab8c534007b815e53a40304e03.json",
"sha256": "2751515524bd17b565fb85cf73d314eb3d75afa4a02cec933041953a99779ffe",
"exit": 1,
"stop_confirmed": true,
"retained_failure_evidence": "/run/media/kmosoti/data/FabricO11y/evidence/fabric-work-63ce04ab8c534007b815e53a40304e03"
}
]
}
Running as unit: fabric-work-63ce04ab8c534007b815e53a40304e03.service
resource group: /user.slice/user-1000.slice/[email protected]/app.slice/fabric-work-63ce04ab8c534007b815e53a40304e03.service; memory.max=21474836480; swap.max=0
FFFF
======================================================================
FAIL: test_same_code_fixture_archive_errors_preserve_failed_receipt (test_packaging.PackageTests.test_same_code_fixture_archive_errors_preserve_failed_receipt) (defect='truncated-control-tar')
----------------------------------------------------------------------
Traceback (most recent call last):
File "/run/media/kmosoti/data/FabricO11y/scratch/owner-fixture-archive-counterexample/tools/packaging/test_packaging.py", line 94, in test_same_code_fixture_archive_errors_preserve_failed_receipt
self.assertIsNone(escaped, 'archive exception escaped without an archived failed verdict')
~~~~~~~~~~~~~~~~~^^^^^^^^^^^^^^^^^^^^^^^^^^^^^^^^^^^^^^^^^^^^^^^^^^^^^^^^^^^^^^^^^^^^^^^^^
AssertionError: ReadError("file could not be opened successfully:\n- method gz: ReadError('not a gzip file')\n- method bz2: ReadError('not a bzip2 file')\n- method xz: ReadError('not an lzma file')\n- method zst: ReadError('not a zstd file')\n- method tar: ReadError('truncated header')") is not None : archive exception escaped without an archived failed verdict
======================================================================
FAIL: test_same_code_fixture_archive_errors_preserve_failed_receipt (test_packaging.PackageTests.test_same_code_fixture_archive_errors_preserve_failed_receipt) (defect='invalid-xz')
----------------------------------------------------------------------
Traceback (most recent call last):
File "/run/media/kmosoti/data/FabricO11y/scratch/owner-fixture-archive-counterexample/tools/packaging/test_packaging.py", line 94, in test_same_code_fixture_archive_errors_preserve_failed_receipt
self.assertIsNone(escaped, 'archive exception escaped without an archived failed verdict')
~~~~~~~~~~~~~~~~~^^^^^^^^^^^^^^^^^^^^^^^^^^^^^^^^^^^^^^^^^^^^^^^^^^^^^^^^^^^^^^^^^^^^^^^^^
AssertionError: LZMAError('Input format not supported by decoder') is not None : archive exception escaped without an archived failed verdict
======================================================================
FAIL: test_same_code_fixture_archive_errors_preserve_failed_receipt (test_packaging.PackageTests.test_same_code_fixture_archive_errors_preserve_failed_receipt) (defect='missing-member')
----------------------------------------------------------------------
Traceback (most recent call last):
File "/run/media/kmosoti/data/FabricO11y/scratch/owner-fixture-archive-counterexample/tools/packaging/test_packaging.py", line 94, in test_same_code_fixture_archive_errors_preserve_failed_receipt
self.assertIsNone(escaped, 'archive exception escaped without an archived failed verdict')
~~~~~~~~~~~~~~~~~^^^^^^^^^^^^^^^^^^^^^^^^^^^^^^^^^^^^^^^^^^^^^^^^^^^^^^^^^^^^^^^^^^^^^^^^^
AssertionError: KeyError('literal-required-control-member') is not None : archive exception escaped without an archived failed verdict
======================================================================
FAIL: test_same_code_fixture_archive_errors_preserve_failed_receipt (test_packaging.PackageTests.test_same_code_fixture_archive_errors_preserve_failed_receipt) (defect='truncated-member')
----------------------------------------------------------------------
Traceback (most recent call last):
File "/run/media/kmosoti/data/FabricO11y/scratch/owner-fixture-archive-counterexample/tools/packaging/test_packaging.py", line 94, in test_same_code_fixture_archive_errors_preserve_failed_receipt
self.assertIsNone(escaped, 'archive exception escaped without an archived failed verdict')
~~~~~~~~~~~~~~~~~^^^^^^^^^^^^^^^^^^^^^^^^^^^^^^^^^^^^^^^^^^^^^^^^^^^^^^^^^^^^^^^^^^^^^^^^^
AssertionError: EOFError('literal truncated archive member') is not None : archive exception escaped without an archived failed verdict
----------------------------------------------------------------------
Ran 1 test in 0.011s
FAILED (failures=4)
Finished with result: exit-code
Main processes terminated with: code=exited, status=1/FAILURE
Service runtime: 184ms
CPU time consumed: 135ms
Memory peak: 24.3M (swap: 0B)
Resource receipt SHA256 2751515524bd17b565fb85cf73d314eb3d75afa4a02cec933041953a99779ffe.
{
"unit": "fabric-work-63ce04ab8c534007b815e53a40304e03",
"command": [
"env",
"PYTHONPATH=/run/media/kmosoti/data/FabricO11y/scratch/owner-fixture-archive-counterexample/tools/packaging",
"python3",
"-B",
"-m",
"unittest",
"test_packaging.PackageTests.test_same_code_fixture_archive_errors_preserve_failed_receipt"
],
"exit": 1,
"wrapper_exit": 1,
"command_receipt": {
"unit": "fabric-work-63ce04ab8c534007b815e53a40304e03",
"command": [
"env",
"PYTHONPATH=/run/media/kmosoti/data/FabricO11y/scratch/owner-fixture-archive-counterexample/tools/packaging",
"python3",
"-B",
"-m",
"unittest",
"test_packaging.PackageTests.test_same_code_fixture_archive_errors_preserve_failed_receipt"
],
"cgroup": "/sys/fs/cgroup/user.slice/user-1000.slice/[email protected]/app.slice/fabric-work-63ce04ab8c534007b815e53a40304e03.service",
"state": "completed",
"exit": 1,
"resource_observation": "command_return_before_service_stop",
"resources": {
"memory.peak": "25513984",
"memory.events": "low 0\nhigh 0\nmax 0\noom 0\noom_kill 0\noom_group_kill 0\nsock_throttled 0",
"cpu.stat": "usage_usec 130771\nuser_usec 102814\nsystem_usec 27957\nnice_usec 0\ncore_sched.force_idle_usec 0\nnr_periods 0\nnr_throttled 0\nthrottled_usec 0\nnr_bursts 0\nburst_usec 0"
}
},
"stop_confirmed": true,
"stop_error": null,
"started_unix": 1791855269.0455985,
"elapsed_s": 0.19752097129821777,
"storage_root": "/run/media/kmosoti/data/FabricO11y",
"temporary": "/run/media/kmosoti/data/FabricO11y/scratch/work-pidivf1i",
"temporary_removed": true,
"retained_failure_evidence": "/run/media/kmosoti/data/FabricO11y/evidence/fabric-work-63ce04ab8c534007b815e53a40304e03",
"memory_high_bytes": 17179869184,
"memory_max_bytes": 21474836480,
"swap_max_bytes": 0,
"runtime_max_seconds": 1800,
"delegated": false
}
owner-walkthrough-fixture-metadata-green-02
Outer record SHA256 209c9ff8442de5f5c042c2b88a2e8cf8f22eec3f5994743e269fc15731816c70.
{
"label": "owner-walkthrough-fixture-metadata-green-02",
"command": [
"env",
"PYTHONPATH=/run/media/kmosoti/data/FabricO11y/scratch/owner-walkthrough-harness/tools/packaging",
"python3",
"-B",
"-m",
"unittest",
"test_packaging.PackageTests.test_same_code_fixture_archive_errors_preserve_failed_receipt",
"test_packaging.PackageTests.test_same_code_fixture_deb_tar_header_controls",
"test_packaging.PackageTests.test_same_code_fixture_rpm_provide_and_weak_dependency_controls",
"test_payload.PayloadTests.test_extraction_failure_retains_stderr_and_command"
],
"delegated": false,
"frozen": null,
"scope": "harness controls only; no candidate acceptance evidence",
"harness_revision": "ea7ba1741fbafa3500ac1e7e71d6b8671e24f90e",
"source_status_before": "",
"storage_root": "/run/media/kmosoti/data/FabricO11y",
"admission_bytes": 89232878835,
"admission_observation": {
"data_bytes": 89232878835,
"regular_path_bytes": 89232843578,
"path_count": 447683,
"uid": 0,
"gid": 0,
"attempt": 1
},
"reserved_bytes": 1073741824,
"observations": [],
"started_utc": "2026-10-13T01:32:13.328718+00:00",
"state": "completed",
"log": "/run/media/kmosoti/data/FabricO11y/results/service-opening-candidate/owner-walkthrough-fixture-metadata-green-02.log",
"launcher_exit": 0,
"exit": 0,
"source_status_after": "",
"finished_utc": "2026-10-13T01:32:14.335249+00:00",
"log_sha256": "22a59fd56e9eb745b20af8331abbcec605fbcdc94e8e813fe7c21f8276d56e92",
"resource_receipts": [
{
"path": "/run/media/kmosoti/data/FabricO11y/results/service-opening-candidate/resource-containment/fabric-work-3108b70f0c594655a5e101e5b7751f19.json",
"sha256": "e3122eec1245a22f72be37448b62071b1815ca74a9208b264115aa04c4890cbf",
"exit": 0,
"stop_confirmed": true,
"retained_failure_evidence": null
}
]
}
Running as unit: fabric-work-3108b70f0c594655a5e101e5b7751f19.service
resource group: /user.slice/user-1000.slice/[email protected]/app.slice/fabric-work-3108b70f0c594655a5e101e5b7751f19.service; memory.max=21474836480; swap.max=0
....
----------------------------------------------------------------------
Ran 4 tests in 0.087s
OK
{
"state": "failed",
"exit": 2,
"role": "same implementation, lower native metadata only; not historical migration",
"source": {
"original_head": "8fb6f413179b094288316e25845c137440ba23fa",
"source_date_epoch": 1791841113
},
"harness_commit": "1111111111111111111111111111111111111111",
"inputs": {
"/run/media/kmosoti/data/FabricO11y/scratch/work-r8sc2xds/tmpoxm506qk/deb-receipt.json": "e2c21a55dc478a84e35f7301f290bc6b1700f3ca90478156114e093781d4bfc2",
"/run/media/kmosoti/data/FabricO11y/scratch/work-r8sc2xds/tmpoxm506qk/debian": "8b4a5990f23bc91e01b49339ad387721fcf6c6fcdbbd6a6d2e6c4132bc3f8c55",
"/run/media/kmosoti/data/FabricO11y/scratch/work-r8sc2xds/tmpoxm506qk/fedora": "8b4a5990f23bc91e01b49339ad387721fcf6c6fcdbbd6a6d2e6c4132bc3f8c55"
},
"constructor_sha256": "509964b74d5808de3ff63ba853057d754cab97bb3f90f3889c33e21eadcbe17e",
"payload_parser_sha256": "c70736ddc395fb0c029513aea2fa0640c501c9c9c31e6fa36318877f3fc67f74",
"input_validator_sha256": "3dfd336bd132fa7d904aea783c81db94f6832bea304474d86250cb2329dbec44",
"rpm_builder_sha256": "f245284304eac4dcc0d7b585ce5446a7d921eb687602cc62c395e87d0ff4e8c5",
"commands": [
{
"command": [
"dpkg-deb",
"-R",
"/run/media/kmosoti/data/FabricO11y/scratch/work-r8sc2xds/tmpoxm506qk/debian",
"/run/media/kmosoti/data/FabricO11y/scratch/work-r8sc2xds/tmpoxm506qk/owner-fixture-8dexddxn/deb"
],
"exit": null
}
],
"packages": {},
"native_comparisons": [
{
"command": [
"dpkg",
"--compare-versions",
"0.1.0~alpha.0",
"lt",
"0.1.0~alpha.1"
],
"exit": 0,
"stdout": ""
},
{
"command": [
"rpm",
"--eval",
"%{lua: print(rpm.vercmp('0:0.1.0-0.alpha.0','0:0.1.0-0.alpha.1'))}"
],
"exit": 0,
"stdout": "-1"
}
],
"error": "file could not be opened successfully:\n- method gz: ReadError('not a gzip file')\n- method bz2: ReadError('not a bzip2 file')\n- method xz: ReadError('not an lzma file')\n- method zst: ReadError('not a zstd file')\n- method tar: ReadError('truncated header')",
"failure_evidence": "/run/media/kmosoti/data/FabricO11y/scratch/work-r8sc2xds/tmpoxm506qk/results/out/failed-fixture-work"
}
{
"state": "failed",
"exit": 2,
"role": "same implementation, lower native metadata only; not historical migration",
"source": {
"original_head": "8fb6f413179b094288316e25845c137440ba23fa",
"source_date_epoch": 1791841113
},
"harness_commit": "1111111111111111111111111111111111111111",
"inputs": {
"/run/media/kmosoti/data/FabricO11y/scratch/work-r8sc2xds/tmpfwl8mjb2/deb-receipt.json": "e2c21a55dc478a84e35f7301f290bc6b1700f3ca90478156114e093781d4bfc2",
"/run/media/kmosoti/data/FabricO11y/scratch/work-r8sc2xds/tmpfwl8mjb2/debian": "8b4a5990f23bc91e01b49339ad387721fcf6c6fcdbbd6a6d2e6c4132bc3f8c55",
"/run/media/kmosoti/data/FabricO11y/scratch/work-r8sc2xds/tmpfwl8mjb2/fedora": "8b4a5990f23bc91e01b49339ad387721fcf6c6fcdbbd6a6d2e6c4132bc3f8c55"
},
"constructor_sha256": "509964b74d5808de3ff63ba853057d754cab97bb3f90f3889c33e21eadcbe17e",
"payload_parser_sha256": "c70736ddc395fb0c029513aea2fa0640c501c9c9c31e6fa36318877f3fc67f74",
"input_validator_sha256": "3dfd336bd132fa7d904aea783c81db94f6832bea304474d86250cb2329dbec44",
"rpm_builder_sha256": "f245284304eac4dcc0d7b585ce5446a7d921eb687602cc62c395e87d0ff4e8c5",
"commands": [
{
"command": [
"dpkg-deb",
"-R",
"/run/media/kmosoti/data/FabricO11y/scratch/work-r8sc2xds/tmpfwl8mjb2/debian",
"/run/media/kmosoti/data/FabricO11y/scratch/work-r8sc2xds/tmpfwl8mjb2/owner-fixture-bcifuuse/deb"
],
"exit": null
}
],
"packages": {},
"native_comparisons": [
{
"command": [
"dpkg",
"--compare-versions",
"0.1.0~alpha.0",
"lt",
"0.1.0~alpha.1"
],
"exit": 0,
"stdout": ""
},
{
"command": [
"rpm",
"--eval",
"%{lua: print(rpm.vercmp('0:0.1.0-0.alpha.0','0:0.1.0-0.alpha.1'))}"
],
"exit": 0,
"stdout": "-1"
}
],
"error": "Input format not supported by decoder",
"failure_evidence": "/run/media/kmosoti/data/FabricO11y/scratch/work-r8sc2xds/tmpfwl8mjb2/results/out/failed-fixture-work"
}
{
"state": "failed",
"exit": 2,
"role": "same implementation, lower native metadata only; not historical migration",
"source": {
"original_head": "8fb6f413179b094288316e25845c137440ba23fa",
"source_date_epoch": 1791841113
},
"harness_commit": "1111111111111111111111111111111111111111",
"inputs": {
"/run/media/kmosoti/data/FabricO11y/scratch/work-r8sc2xds/tmpc5t9o7n2/deb-receipt.json": "e2c21a55dc478a84e35f7301f290bc6b1700f3ca90478156114e093781d4bfc2",
"/run/media/kmosoti/data/FabricO11y/scratch/work-r8sc2xds/tmpc5t9o7n2/debian": "8b4a5990f23bc91e01b49339ad387721fcf6c6fcdbbd6a6d2e6c4132bc3f8c55",
"/run/media/kmosoti/data/FabricO11y/scratch/work-r8sc2xds/tmpc5t9o7n2/fedora": "8b4a5990f23bc91e01b49339ad387721fcf6c6fcdbbd6a6d2e6c4132bc3f8c55"
},
"constructor_sha256": "509964b74d5808de3ff63ba853057d754cab97bb3f90f3889c33e21eadcbe17e",
"payload_parser_sha256": "c70736ddc395fb0c029513aea2fa0640c501c9c9c31e6fa36318877f3fc67f74",
"input_validator_sha256": "3dfd336bd132fa7d904aea783c81db94f6832bea304474d86250cb2329dbec44",
"rpm_builder_sha256": "f245284304eac4dcc0d7b585ce5446a7d921eb687602cc62c395e87d0ff4e8c5",
"commands": [
{
"command": [
"dpkg-deb",
"-R",
"/run/media/kmosoti/data/FabricO11y/scratch/work-r8sc2xds/tmpc5t9o7n2/debian",
"/run/media/kmosoti/data/FabricO11y/scratch/work-r8sc2xds/tmpc5t9o7n2/owner-fixture-3jazavbq/deb"
],
"exit": null
}
],
"packages": {},
"native_comparisons": [
{
"command": [
"dpkg",
"--compare-versions",
"0.1.0~alpha.0",
"lt",
"0.1.0~alpha.1"
],
"exit": 0,
"stdout": ""
},
{
"command": [
"rpm",
"--eval",
"%{lua: print(rpm.vercmp('0:0.1.0-0.alpha.0','0:0.1.0-0.alpha.1'))}"
],
"exit": 0,
"stdout": "-1"
}
],
"error": "'literal-required-control-member'",
"failure_evidence": "/run/media/kmosoti/data/FabricO11y/scratch/work-r8sc2xds/tmpc5t9o7n2/results/out/failed-fixture-work"
}
{
"state": "failed",
"exit": 2,
"role": "same implementation, lower native metadata only; not historical migration",
"source": {
"original_head": "8fb6f413179b094288316e25845c137440ba23fa",
"source_date_epoch": 1791841113
},
"harness_commit": "1111111111111111111111111111111111111111",
"inputs": {
"/run/media/kmosoti/data/FabricO11y/scratch/work-r8sc2xds/tmplcuh1eez/deb-receipt.json": "e2c21a55dc478a84e35f7301f290bc6b1700f3ca90478156114e093781d4bfc2",
"/run/media/kmosoti/data/FabricO11y/scratch/work-r8sc2xds/tmplcuh1eez/debian": "8b4a5990f23bc91e01b49339ad387721fcf6c6fcdbbd6a6d2e6c4132bc3f8c55",
"/run/media/kmosoti/data/FabricO11y/scratch/work-r8sc2xds/tmplcuh1eez/fedora": "8b4a5990f23bc91e01b49339ad387721fcf6c6fcdbbd6a6d2e6c4132bc3f8c55"
},
"constructor_sha256": "509964b74d5808de3ff63ba853057d754cab97bb3f90f3889c33e21eadcbe17e",
"payload_parser_sha256": "c70736ddc395fb0c029513aea2fa0640c501c9c9c31e6fa36318877f3fc67f74",
"input_validator_sha256": "3dfd336bd132fa7d904aea783c81db94f6832bea304474d86250cb2329dbec44",
"rpm_builder_sha256": "f245284304eac4dcc0d7b585ce5446a7d921eb687602cc62c395e87d0ff4e8c5",
"commands": [
{
"command": [
"dpkg-deb",
"-R",
"/run/media/kmosoti/data/FabricO11y/scratch/work-r8sc2xds/tmplcuh1eez/debian",
"/run/media/kmosoti/data/FabricO11y/scratch/work-r8sc2xds/tmplcuh1eez/owner-fixture-_nj5m1h1/deb"
],
"exit": null
}
],
"packages": {},
"native_comparisons": [
{
"command": [
"dpkg",
"--compare-versions",
"0.1.0~alpha.0",
"lt",
"0.1.0~alpha.1"
],
"exit": 0,
"stdout": ""
},
{
"command": [
"rpm",
"--eval",
"%{lua: print(rpm.vercmp('0:0.1.0-0.alpha.0','0:0.1.0-0.alpha.1'))}"
],
"exit": 0,
"stdout": "-1"
}
],
"error": "literal truncated archive member",
"failure_evidence": "/run/media/kmosoti/data/FabricO11y/scratch/work-r8sc2xds/tmplcuh1eez/results/out/failed-fixture-work"
}
Finished with result: success
Main processes terminated with: code=exited, status=0/SUCCESS
Service runtime: 268ms
CPU time consumed: 214ms
Memory peak: 28.1M (swap: 0B)
Resource receipt SHA256 e3122eec1245a22f72be37448b62071b1815ca74a9208b264115aa04c4890cbf.
{
"unit": "fabric-work-3108b70f0c594655a5e101e5b7751f19",
"command": [
"env",
"PYTHONPATH=/run/media/kmosoti/data/FabricO11y/scratch/owner-walkthrough-harness/tools/packaging",
"python3",
"-B",
"-m",
"unittest",
"test_packaging.PackageTests.test_same_code_fixture_archive_errors_preserve_failed_receipt",
"test_packaging.PackageTests.test_same_code_fixture_deb_tar_header_controls",
"test_packaging.PackageTests.test_same_code_fixture_rpm_provide_and_weak_dependency_controls",
"test_payload.PayloadTests.test_extraction_failure_retains_stderr_and_command"
],
"exit": 0,
"wrapper_exit": 0,
"command_receipt": {
"unit": "fabric-work-3108b70f0c594655a5e101e5b7751f19",
"command": [
"env",
"PYTHONPATH=/run/media/kmosoti/data/FabricO11y/scratch/owner-walkthrough-harness/tools/packaging",
"python3",
"-B",
"-m",
"unittest",
"test_packaging.PackageTests.test_same_code_fixture_archive_errors_preserve_failed_receipt",
"test_packaging.PackageTests.test_same_code_fixture_deb_tar_header_controls",
"test_packaging.PackageTests.test_same_code_fixture_rpm_provide_and_weak_dependency_controls",
"test_payload.PayloadTests.test_extraction_failure_retains_stderr_and_command"
],
"cgroup": "/sys/fs/cgroup/user.slice/user-1000.slice/[email protected]/app.slice/fabric-work-3108b70f0c594655a5e101e5b7751f19.service",
"state": "completed",
"exit": 0,
"resource_observation": "command_return_before_service_stop",
"resources": {
"memory.peak": "29487104",
"memory.events": "low 0\nhigh 0\nmax 0\noom 0\noom_kill 0\noom_group_kill 0\nsock_throttled 0",
"cpu.stat": "usage_usec 209216\nuser_usec 192300\nsystem_usec 16915\nnice_usec 0\ncore_sched.force_idle_usec 0\nnr_periods 0\nnr_throttled 0\nthrottled_usec 0\nnr_bursts 0\nburst_usec 0"
}
},
"stop_confirmed": true,
"stop_error": null,
"started_unix": 1791855133.3613603,
"elapsed_s": 0.28255319595336914,
"storage_root": "/run/media/kmosoti/data/FabricO11y",
"temporary": "/run/media/kmosoti/data/FabricO11y/scratch/work-r8sc2xds",
"temporary_removed": true,
"retained_failure_evidence": null,
"memory_high_bytes": 17179869184,
"memory_max_bytes": 21474836480,
"swap_max_bytes": 0,
"runtime_max_seconds": 1800,
"delegated": false
}
owner-walkthrough-packaging-and-payload-green-01
Outer record SHA256 9f770f1012ebd17d7f3ed21744c64779b72fc06a8f8fecbb973345b62043fead.
{
"label": "owner-walkthrough-packaging-and-payload-green-01",
"command": [
"env",
"PYTHONPATH=/run/media/kmosoti/data/FabricO11y/scratch/owner-walkthrough-harness/tools/packaging",
"python3",
"-B",
"-m",
"unittest",
"test_packaging",
"test_payload"
],
"delegated": false,
"frozen": null,
"scope": "harness controls only; no candidate acceptance evidence",
"harness_revision": "ea7ba1741fbafa3500ac1e7e71d6b8671e24f90e",
"source_status_before": "",
"storage_root": "/run/media/kmosoti/data/FabricO11y",
"admission_bytes": 89232897202,
"admission_observation": {
"data_bytes": 89232897202,
"regular_path_bytes": 89232861945,
"path_count": 447687,
"uid": 0,
"gid": 0,
"attempt": 1
},
"reserved_bytes": 1073741824,
"observations": [],
"started_utc": "2026-10-13T01:32:53.311132+00:00",
"state": "completed",
"log": "/run/media/kmosoti/data/FabricO11y/results/service-opening-candidate/owner-walkthrough-packaging-and-payload-green-01.log",
"launcher_exit": 0,
"exit": 0,
"source_status_after": "",
"finished_utc": "2026-10-13T01:32:54.316812+00:00",
"log_sha256": "590688122af21e87a8f71c96324871dd6f084e6e49c28b8f542b95688ed601db",
"resource_receipts": [
{
"path": "/run/media/kmosoti/data/FabricO11y/results/service-opening-candidate/resource-containment/fabric-work-627b7ed575a74fd1b4625ed0443ae192.json",
"sha256": "7a4eeb06aaf1c49245098e14dd3721730a7eb407ee0f6bcc503b5c2199d1387d",
"exit": 0,
"stop_confirmed": true,
"retained_failure_evidence": null
}
]
}
Running as unit: fabric-work-627b7ed575a74fd1b4625ed0443ae192.service
resource group: /user.slice/user-1000.slice/[email protected]/app.slice/fabric-work-627b7ed575a74fd1b4625ed0443ae192.service; memory.max=21474836480; swap.max=0
.................
----------------------------------------------------------------------
Ran 17 tests in 0.184s
OK
{
"state": "failed",
"exit": 2,
"role": "same implementation, lower native metadata only; not historical migration",
"source": {
"original_head": "8fb6f413179b094288316e25845c137440ba23fa",
"source_date_epoch": 1791841113
},
"harness_commit": "1111111111111111111111111111111111111111",
"inputs": {
"/run/media/kmosoti/data/FabricO11y/scratch/work-7szdntdi/tmp6rf7ipxt/deb-receipt.json": "e2c21a55dc478a84e35f7301f290bc6b1700f3ca90478156114e093781d4bfc2",
"/run/media/kmosoti/data/FabricO11y/scratch/work-7szdntdi/tmp6rf7ipxt/debian": "8b4a5990f23bc91e01b49339ad387721fcf6c6fcdbbd6a6d2e6c4132bc3f8c55",
"/run/media/kmosoti/data/FabricO11y/scratch/work-7szdntdi/tmp6rf7ipxt/fedora": "8b4a5990f23bc91e01b49339ad387721fcf6c6fcdbbd6a6d2e6c4132bc3f8c55"
},
"constructor_sha256": "509964b74d5808de3ff63ba853057d754cab97bb3f90f3889c33e21eadcbe17e",
"payload_parser_sha256": "c70736ddc395fb0c029513aea2fa0640c501c9c9c31e6fa36318877f3fc67f74",
"input_validator_sha256": "3dfd336bd132fa7d904aea783c81db94f6832bea304474d86250cb2329dbec44",
"rpm_builder_sha256": "f245284304eac4dcc0d7b585ce5446a7d921eb687602cc62c395e87d0ff4e8c5",
"commands": [
{
"command": [
"dpkg-deb",
"-R",
"/run/media/kmosoti/data/FabricO11y/scratch/work-7szdntdi/tmp6rf7ipxt/debian",
"/run/media/kmosoti/data/FabricO11y/scratch/work-7szdntdi/tmp6rf7ipxt/owner-fixture-1rncg5c8/deb"
],
"exit": null
}
],
"packages": {},
"native_comparisons": [
{
"command": [
"dpkg",
"--compare-versions",
"0.1.0~alpha.0",
"lt",
"0.1.0~alpha.1"
],
"exit": 0,
"stdout": ""
},
{
"command": [
"rpm",
"--eval",
"%{lua: print(rpm.vercmp('0:0.1.0-0.alpha.0','0:0.1.0-0.alpha.1'))}"
],
"exit": 0,
"stdout": "-1"
}
],
"error": "file could not be opened successfully:\n- method gz: ReadError('not a gzip file')\n- method bz2: ReadError('not a bzip2 file')\n- method xz: ReadError('not an lzma file')\n- method zst: ReadError('not a zstd file')\n- method tar: ReadError('truncated header')",
"failure_evidence": "/run/media/kmosoti/data/FabricO11y/scratch/work-7szdntdi/tmp6rf7ipxt/results/out/failed-fixture-work"
}
{
"state": "failed",
"exit": 2,
"role": "same implementation, lower native metadata only; not historical migration",
"source": {
"original_head": "8fb6f413179b094288316e25845c137440ba23fa",
"source_date_epoch": 1791841113
},
"harness_commit": "1111111111111111111111111111111111111111",
"inputs": {
"/run/media/kmosoti/data/FabricO11y/scratch/work-7szdntdi/tmp7puezxfk/deb-receipt.json": "e2c21a55dc478a84e35f7301f290bc6b1700f3ca90478156114e093781d4bfc2",
"/run/media/kmosoti/data/FabricO11y/scratch/work-7szdntdi/tmp7puezxfk/debian": "8b4a5990f23bc91e01b49339ad387721fcf6c6fcdbbd6a6d2e6c4132bc3f8c55",
"/run/media/kmosoti/data/FabricO11y/scratch/work-7szdntdi/tmp7puezxfk/fedora": "8b4a5990f23bc91e01b49339ad387721fcf6c6fcdbbd6a6d2e6c4132bc3f8c55"
},
"constructor_sha256": "509964b74d5808de3ff63ba853057d754cab97bb3f90f3889c33e21eadcbe17e",
"payload_parser_sha256": "c70736ddc395fb0c029513aea2fa0640c501c9c9c31e6fa36318877f3fc67f74",
"input_validator_sha256": "3dfd336bd132fa7d904aea783c81db94f6832bea304474d86250cb2329dbec44",
"rpm_builder_sha256": "f245284304eac4dcc0d7b585ce5446a7d921eb687602cc62c395e87d0ff4e8c5",
"commands": [
{
"command": [
"dpkg-deb",
"-R",
"/run/media/kmosoti/data/FabricO11y/scratch/work-7szdntdi/tmp7puezxfk/debian",
"/run/media/kmosoti/data/FabricO11y/scratch/work-7szdntdi/tmp7puezxfk/owner-fixture-qhpol850/deb"
],
"exit": null
}
],
"packages": {},
"native_comparisons": [
{
"command": [
"dpkg",
"--compare-versions",
"0.1.0~alpha.0",
"lt",
"0.1.0~alpha.1"
],
"exit": 0,
"stdout": ""
},
{
"command": [
"rpm",
"--eval",
"%{lua: print(rpm.vercmp('0:0.1.0-0.alpha.0','0:0.1.0-0.alpha.1'))}"
],
"exit": 0,
"stdout": "-1"
}
],
"error": "Input format not supported by decoder",
"failure_evidence": "/run/media/kmosoti/data/FabricO11y/scratch/work-7szdntdi/tmp7puezxfk/results/out/failed-fixture-work"
}
{
"state": "failed",
"exit": 2,
"role": "same implementation, lower native metadata only; not historical migration",
"source": {
"original_head": "8fb6f413179b094288316e25845c137440ba23fa",
"source_date_epoch": 1791841113
},
"harness_commit": "1111111111111111111111111111111111111111",
"inputs": {
"/run/media/kmosoti/data/FabricO11y/scratch/work-7szdntdi/tmpw87lnn5a/deb-receipt.json": "e2c21a55dc478a84e35f7301f290bc6b1700f3ca90478156114e093781d4bfc2",
"/run/media/kmosoti/data/FabricO11y/scratch/work-7szdntdi/tmpw87lnn5a/debian": "8b4a5990f23bc91e01b49339ad387721fcf6c6fcdbbd6a6d2e6c4132bc3f8c55",
"/run/media/kmosoti/data/FabricO11y/scratch/work-7szdntdi/tmpw87lnn5a/fedora": "8b4a5990f23bc91e01b49339ad387721fcf6c6fcdbbd6a6d2e6c4132bc3f8c55"
},
"constructor_sha256": "509964b74d5808de3ff63ba853057d754cab97bb3f90f3889c33e21eadcbe17e",
"payload_parser_sha256": "c70736ddc395fb0c029513aea2fa0640c501c9c9c31e6fa36318877f3fc67f74",
"input_validator_sha256": "3dfd336bd132fa7d904aea783c81db94f6832bea304474d86250cb2329dbec44",
"rpm_builder_sha256": "f245284304eac4dcc0d7b585ce5446a7d921eb687602cc62c395e87d0ff4e8c5",
"commands": [
{
"command": [
"dpkg-deb",
"-R",
"/run/media/kmosoti/data/FabricO11y/scratch/work-7szdntdi/tmpw87lnn5a/debian",
"/run/media/kmosoti/data/FabricO11y/scratch/work-7szdntdi/tmpw87lnn5a/owner-fixture-p18u50j3/deb"
],
"exit": null
}
],
"packages": {},
"native_comparisons": [
{
"command": [
"dpkg",
"--compare-versions",
"0.1.0~alpha.0",
"lt",
"0.1.0~alpha.1"
],
"exit": 0,
"stdout": ""
},
{
"command": [
"rpm",
"--eval",
"%{lua: print(rpm.vercmp('0:0.1.0-0.alpha.0','0:0.1.0-0.alpha.1'))}"
],
"exit": 0,
"stdout": "-1"
}
],
"error": "'literal-required-control-member'",
"failure_evidence": "/run/media/kmosoti/data/FabricO11y/scratch/work-7szdntdi/tmpw87lnn5a/results/out/failed-fixture-work"
}
{
"state": "failed",
"exit": 2,
"role": "same implementation, lower native metadata only; not historical migration",
"source": {
"original_head": "8fb6f413179b094288316e25845c137440ba23fa",
"source_date_epoch": 1791841113
},
"harness_commit": "1111111111111111111111111111111111111111",
"inputs": {
"/run/media/kmosoti/data/FabricO11y/scratch/work-7szdntdi/tmpldyvq8dm/deb-receipt.json": "e2c21a55dc478a84e35f7301f290bc6b1700f3ca90478156114e093781d4bfc2",
"/run/media/kmosoti/data/FabricO11y/scratch/work-7szdntdi/tmpldyvq8dm/debian": "8b4a5990f23bc91e01b49339ad387721fcf6c6fcdbbd6a6d2e6c4132bc3f8c55",
"/run/media/kmosoti/data/FabricO11y/scratch/work-7szdntdi/tmpldyvq8dm/fedora": "8b4a5990f23bc91e01b49339ad387721fcf6c6fcdbbd6a6d2e6c4132bc3f8c55"
},
"constructor_sha256": "509964b74d5808de3ff63ba853057d754cab97bb3f90f3889c33e21eadcbe17e",
"payload_parser_sha256": "c70736ddc395fb0c029513aea2fa0640c501c9c9c31e6fa36318877f3fc67f74",
"input_validator_sha256": "3dfd336bd132fa7d904aea783c81db94f6832bea304474d86250cb2329dbec44",
"rpm_builder_sha256": "f245284304eac4dcc0d7b585ce5446a7d921eb687602cc62c395e87d0ff4e8c5",
"commands": [
{
"command": [
"dpkg-deb",
"-R",
"/run/media/kmosoti/data/FabricO11y/scratch/work-7szdntdi/tmpldyvq8dm/debian",
"/run/media/kmosoti/data/FabricO11y/scratch/work-7szdntdi/tmpldyvq8dm/owner-fixture-0mahpdi3/deb"
],
"exit": null
}
],
"packages": {},
"native_comparisons": [
{
"command": [
"dpkg",
"--compare-versions",
"0.1.0~alpha.0",
"lt",
"0.1.0~alpha.1"
],
"exit": 0,
"stdout": ""
},
{
"command": [
"rpm",
"--eval",
"%{lua: print(rpm.vercmp('0:0.1.0-0.alpha.0','0:0.1.0-0.alpha.1'))}"
],
"exit": 0,
"stdout": "-1"
}
],
"error": "literal truncated archive member",
"failure_evidence": "/run/media/kmosoti/data/FabricO11y/scratch/work-7szdntdi/tmpldyvq8dm/results/out/failed-fixture-work"
}
Finished with result: success
Main processes terminated with: code=exited, status=0/SUCCESS
Service runtime: 372ms
CPU time consumed: 310ms
Memory peak: 29.2M (swap: 0B)
Resource receipt SHA256 7a4eeb06aaf1c49245098e14dd3721730a7eb407ee0f6bcc503b5c2199d1387d.
{
"unit": "fabric-work-627b7ed575a74fd1b4625ed0443ae192",
"command": [
"env",
"PYTHONPATH=/run/media/kmosoti/data/FabricO11y/scratch/owner-walkthrough-harness/tools/packaging",
"python3",
"-B",
"-m",
"unittest",
"test_packaging",
"test_payload"
],
"exit": 0,
"wrapper_exit": 0,
"command_receipt": {
"unit": "fabric-work-627b7ed575a74fd1b4625ed0443ae192",
"command": [
"env",
"PYTHONPATH=/run/media/kmosoti/data/FabricO11y/scratch/owner-walkthrough-harness/tools/packaging",
"python3",
"-B",
"-m",
"unittest",
"test_packaging",
"test_payload"
],
"cgroup": "/sys/fs/cgroup/user.slice/user-1000.slice/[email protected]/app.slice/fabric-work-627b7ed575a74fd1b4625ed0443ae192.service",
"state": "completed",
"exit": 0,
"resource_observation": "command_return_before_service_stop",
"resources": {
"memory.peak": "30629888",
"memory.events": "low 0\nhigh 0\nmax 0\noom 0\noom_kill 0\noom_group_kill 0\nsock_throttled 0",
"cpu.stat": "usage_usec 305489\nuser_usec 237637\nsystem_usec 67852\nnice_usec 0\ncore_sched.force_idle_usec 0\nnr_periods 0\nnr_throttled 0\nthrottled_usec 0\nnr_bursts 0\nburst_usec 0"
}
},
"stop_confirmed": true,
"stop_error": null,
"started_unix": 1791855173.3416638,
"elapsed_s": 0.3858766555786133,
"storage_root": "/run/media/kmosoti/data/FabricO11y",
"temporary": "/run/media/kmosoti/data/FabricO11y/scratch/work-7szdntdi",
"temporary_removed": true,
"retained_failure_evidence": null,
"memory_high_bytes": 17179869184,
"memory_max_bytes": 21474836480,
"swap_max_bytes": 0,
"runtime_max_seconds": 1800,
"delegated": false
}
owner-walkthrough-fixture-process-red-01
Outer record SHA256 94dd05796df4a2608f7da16eee18ac8075bc32fd31fe35c4f643497ec5f34f05.
{
"label": "owner-walkthrough-fixture-process-red-01",
"command": [
"env",
"PYTHONPATH=tools/packaging",
"python3",
"-B",
"-m",
"unittest",
"test_payload.PayloadTests.test_extraction_stops_real_descendant_on_success_and_timeout",
"test_packaging.PackageTests.test_build_stops_real_descendant_on_success_and_timeout",
"test_packaging.PackageTests.test_build_final_drain_interruption_preserves_raw_diagnostics",
"test_packaging.PackageTests.test_constructor_parent_term_preserves_interrupted_receipt_and_stage"
],
"delegated": false,
"frozen": null,
"scope": "harness controls only; no candidate acceptance evidence",
"harness_revision": "98ef2c333b1cda592512e4fe281232cdda20cd6c",
"source_status_before": "",
"storage_root": "/run/media/kmosoti/data/FabricO11y",
"admission_bytes": 89656449402,
"admission_observation": {
"data_bytes": 89656449402,
"regular_path_bytes": 89656392394,
"path_count": 472381,
"uid": 0,
"gid": 0,
"attempt": 1
},
"reserved_bytes": 1073741824,
"observations": [
{
"unix": 1791858285.4276412,
"data_bytes": 89656464662,
"regular_path_bytes": 89656407654,
"path_count": 472390,
"uid": 0,
"gid": 0,
"attempt": 2
}
],
"started_utc": "2026-10-13T02:24:12.378268+00:00",
"state": "completed",
"log": "/run/media/kmosoti/data/FabricO11y/results/service-opening-candidate/owner-walkthrough-fixture-process-red-01.log",
"launcher_exit": 1,
"exit": 1,
"source_status_after": "",
"finished_utc": "2026-10-13T02:24:46.432688+00:00",
"log_sha256": "78c14dab9283a58ed61cde00e0705258ceac0c8bede9bb0b35e8374fc4fe7222",
"resource_receipts": [
{
"path": "/run/media/kmosoti/data/FabricO11y/results/service-opening-candidate/resource-containment/fabric-work-d88a7a91f9a5466ab158f490ce226d0a.json",
"sha256": "23a902310df77e9323a0ebf9419d4931e9efa72bd6a9410bb954f19a3cb32a99",
"exit": 1,
"stop_confirmed": true,
"retained_failure_evidence": "/run/media/kmosoti/data/FabricO11y/evidence/fabric-work-d88a7a91f9a5466ab158f490ce226d0a"
}
]
}
Running as unit: fabric-work-d88a7a91f9a5466ab158f490ce226d0a.service
resource group: /user.slice/user-1000.slice/[email protected]/app.slice/fabric-work-d88a7a91f9a5466ab158f490ce226d0a.service; memory.max=21474836480; swap.max=0
resource group: /user.slice/user-1000.slice/[email protected]/app.slice/fabric-work-d88a7a91f9a5466ab158f490ce226d0a.service; memory.max=21474836480; swap.max=0
Fresource group: /user.slice/user-1000.slice/[email protected]/app.slice/fabric-work-d88a7a91f9a5466ab158f490ce226d0a.service; memory.max=21474836480; swap.max=0
Fresource group: /user.slice/user-1000.slice/[email protected]/app.slice/fabric-work-d88a7a91f9a5466ab158f490ce226d0a.service; memory.max=21474836480; swap.max=0
Fresource group: /user.slice/user-1000.slice/[email protected]/app.slice/fabric-work-d88a7a91f9a5466ab158f490ce226d0a.service; memory.max=21474836480; swap.max=0
Fresource group: /user.slice/user-1000.slice/[email protected]/app.slice/fabric-work-d88a7a91f9a5466ab158f490ce226d0a.service; memory.max=21474836480; swap.max=0
FFresource group: /user.slice/user-1000.slice/[email protected]/app.slice/fabric-work-d88a7a91f9a5466ab158f490ce226d0a.service; memory.max=21474836480; swap.max=0
F
======================================================================
FAIL: test_extraction_stops_real_descendant_on_success_and_timeout (test_payload.PayloadTests.test_extraction_stops_real_descendant_on_success_and_timeout) (mode='success')
----------------------------------------------------------------------
Traceback (most recent call last):
File "/run/media/kmosoti/data/FabricO11y/scratch/owner-walkthrough-harness/tools/packaging/test_payload.py", line 174, in test_extraction_stops_real_descendant_on_success_and_timeout
assert_fixture_stopped(self, directory)
~~~~~~~~~~~~~~~~~~~~~~^^^^^^^^^^^^^^^^^
File "/run/media/kmosoti/data/FabricO11y/scratch/owner-walkthrough-harness/tools/packaging/test_payload.py", line 149, in assert_fixture_stopped
test.assertFalse(fixture_live(directory), 'command returned with live owned descendant')
~~~~~~~~~~~~~~~~^^^^^^^^^^^^^^^^^^^^^^^^^^^^^^^^^^^^^^^^^^^^^^^^^^^^^^^^^^^^^^^^^^^^^^^^
AssertionError: True is not false : command returned with live owned descendant
======================================================================
FAIL: test_extraction_stops_real_descendant_on_success_and_timeout (test_payload.PayloadTests.test_extraction_stops_real_descendant_on_success_and_timeout) (mode='timeout')
----------------------------------------------------------------------
Traceback (most recent call last):
File "/run/media/kmosoti/data/FabricO11y/scratch/owner-walkthrough-harness/tools/packaging/test_payload.py", line 174, in test_extraction_stops_real_descendant_on_success_and_timeout
assert_fixture_stopped(self, directory)
~~~~~~~~~~~~~~~~~~~~~~^^^^^^^^^^^^^^^^^
File "/run/media/kmosoti/data/FabricO11y/scratch/owner-walkthrough-harness/tools/packaging/test_payload.py", line 149, in assert_fixture_stopped
test.assertFalse(fixture_live(directory), 'command returned with live owned descendant')
~~~~~~~~~~~~~~~~^^^^^^^^^^^^^^^^^^^^^^^^^^^^^^^^^^^^^^^^^^^^^^^^^^^^^^^^^^^^^^^^^^^^^^^^
AssertionError: True is not false : command returned with live owned descendant
======================================================================
FAIL: test_build_stops_real_descendant_on_success_and_timeout (test_packaging.PackageTests.test_build_stops_real_descendant_on_success_and_timeout) (mode='success')
----------------------------------------------------------------------
Traceback (most recent call last):
File "/run/media/kmosoti/data/FabricO11y/scratch/owner-walkthrough-harness/tools/packaging/test_packaging.py", line 69, in test_build_stops_real_descendant_on_success_and_timeout
assert_fixture_stopped(self, directory)
~~~~~~~~~~~~~~~~~~~~~~^^^^^^^^^^^^^^^^^
File "/run/media/kmosoti/data/FabricO11y/scratch/owner-walkthrough-harness/tools/packaging/test_payload.py", line 149, in assert_fixture_stopped
test.assertFalse(fixture_live(directory), 'command returned with live owned descendant')
~~~~~~~~~~~~~~~~^^^^^^^^^^^^^^^^^^^^^^^^^^^^^^^^^^^^^^^^^^^^^^^^^^^^^^^^^^^^^^^^^^^^^^^^
AssertionError: True is not false : command returned with live owned descendant
======================================================================
FAIL: test_build_stops_real_descendant_on_success_and_timeout (test_packaging.PackageTests.test_build_stops_real_descendant_on_success_and_timeout) (mode='timeout')
----------------------------------------------------------------------
Traceback (most recent call last):
File "/run/media/kmosoti/data/FabricO11y/scratch/owner-walkthrough-harness/tools/packaging/test_packaging.py", line 69, in test_build_stops_real_descendant_on_success_and_timeout
assert_fixture_stopped(self, directory)
~~~~~~~~~~~~~~~~~~~~~~^^^^^^^^^^^^^^^^^
File "/run/media/kmosoti/data/FabricO11y/scratch/owner-walkthrough-harness/tools/packaging/test_payload.py", line 149, in assert_fixture_stopped
test.assertFalse(fixture_live(directory), 'command returned with live owned descendant')
~~~~~~~~~~~~~~~~^^^^^^^^^^^^^^^^^^^^^^^^^^^^^^^^^^^^^^^^^^^^^^^^^^^^^^^^^^^^^^^^^^^^^^^^
AssertionError: True is not false : command returned with live owned descendant
======================================================================
FAIL: test_build_final_drain_interruption_preserves_raw_diagnostics (test_packaging.PackageTests.test_build_final_drain_interruption_preserves_raw_diagnostics) (stream='stdout')
----------------------------------------------------------------------
Traceback (most recent call last):
File "/run/media/kmosoti/data/FabricO11y/scratch/owner-walkthrough-harness/tools/packaging/test_packaging.py", line 96, in test_build_final_drain_interruption_preserves_raw_diagnostics
self.assertTrue(path.is_file(), 'final drain interruption lost raw ' + stream)
~~~~~~~~~~~~~~~^^^^^^^^^^^^^^^^^^^^^^^^^^^^^^^^^^^^^^^^^^^^^^^^^^^^^^^^^^^^^^^
AssertionError: False is not true : final drain interruption lost raw stdout
======================================================================
FAIL: test_build_final_drain_interruption_preserves_raw_diagnostics (test_packaging.PackageTests.test_build_final_drain_interruption_preserves_raw_diagnostics) (stream='stderr')
----------------------------------------------------------------------
Traceback (most recent call last):
File "/run/media/kmosoti/data/FabricO11y/scratch/owner-walkthrough-harness/tools/packaging/test_packaging.py", line 96, in test_build_final_drain_interruption_preserves_raw_diagnostics
self.assertTrue(path.is_file(), 'final drain interruption lost raw ' + stream)
~~~~~~~~~~~~~~~^^^^^^^^^^^^^^^^^^^^^^^^^^^^^^^^^^^^^^^^^^^^^^^^^^^^^^^^^^^^^^^
AssertionError: False is not true : final drain interruption lost raw stderr
======================================================================
FAIL: test_constructor_parent_term_preserves_interrupted_receipt_and_stage (test_packaging.PackageTests.test_constructor_parent_term_preserves_interrupted_receipt_and_stage)
----------------------------------------------------------------------
Traceback (most recent call last):
File "/run/media/kmosoti/data/FabricO11y/scratch/owner-walkthrough-harness/tools/packaging/test_packaging.py", line 150, in test_constructor_parent_term_preserves_interrupted_receipt_and_stage
self.assertEqual(process.returncode, 2, stdout + stderr)
~~~~~~~~~~~~~~~~^^^^^^^^^^^^^^^^^^^^^^^^^^^^^^^^^^^^^^^^
AssertionError: -15 != 2 : b'resource group: /user.slice/user-1000.slice/[email protected]/app.slice/fabric-work-d88a7a91f9a5466ab158f490ce226d0a.service; memory.max=21474836480; swap.max=0\n'
----------------------------------------------------------------------
Ran 4 tests in 33.311s
FAILED (failures=7)
Finished with result: exit-code
Main processes terminated with: code=exited, status=1/FAILURE
Service runtime: 33.535s
CPU time consumed: 393ms
Memory peak: 47.3M (swap: 0B)
Resource receipt SHA256 23a902310df77e9323a0ebf9419d4931e9efa72bd6a9410bb954f19a3cb32a99.
{
"unit": "fabric-work-d88a7a91f9a5466ab158f490ce226d0a",
"command": [
"env",
"PYTHONPATH=tools/packaging",
"python3",
"-B",
"-m",
"unittest",
"test_payload.PayloadTests.test_extraction_stops_real_descendant_on_success_and_timeout",
"test_packaging.PackageTests.test_build_stops_real_descendant_on_success_and_timeout",
"test_packaging.PackageTests.test_build_final_drain_interruption_preserves_raw_diagnostics",
"test_packaging.PackageTests.test_constructor_parent_term_preserves_interrupted_receipt_and_stage"
],
"exit": 1,
"wrapper_exit": 1,
"command_receipt": {
"unit": "fabric-work-d88a7a91f9a5466ab158f490ce226d0a",
"command": [
"env",
"PYTHONPATH=tools/packaging",
"python3",
"-B",
"-m",
"unittest",
"test_payload.PayloadTests.test_extraction_stops_real_descendant_on_success_and_timeout",
"test_packaging.PackageTests.test_build_stops_real_descendant_on_success_and_timeout",
"test_packaging.PackageTests.test_build_final_drain_interruption_preserves_raw_diagnostics",
"test_packaging.PackageTests.test_constructor_parent_term_preserves_interrupted_receipt_and_stage"
],
"cgroup": "/sys/fs/cgroup/user.slice/user-1000.slice/[email protected]/app.slice/fabric-work-d88a7a91f9a5466ab158f490ce226d0a.service",
"state": "completed",
"exit": 1,
"resource_observation": "command_return_before_service_stop",
"resources": {
"memory.peak": "49692672",
"memory.events": "low 0\nhigh 0\nmax 0\noom 0\noom_kill 0\noom_group_kill 0\nsock_throttled 0",
"cpu.stat": "usage_usec 388168\nuser_usec 310281\nsystem_usec 77886\nnice_usec 0\ncore_sched.force_idle_usec 0\nnr_periods 0\nnr_throttled 0\nthrottled_usec 0\nnr_bursts 0\nburst_usec 0"
}
},
"stop_confirmed": true,
"stop_error": null,
"started_unix": 1791858252.407715,
"elapsed_s": 33.550286531448364,
"storage_root": "/run/media/kmosoti/data/FabricO11y",
"temporary": "/run/media/kmosoti/data/FabricO11y/scratch/work-mfedp1tl",
"temporary_removed": true,
"retained_failure_evidence": "/run/media/kmosoti/data/FabricO11y/evidence/fabric-work-d88a7a91f9a5466ab158f490ce226d0a",
"memory_high_bytes": 17179869184,
"memory_max_bytes": 21474836480,
"swap_max_bytes": 0,
"runtime_max_seconds": 1800,
"delegated": false
}
owner-fixture-closeout-term-red-01
Outer record SHA256 1aeb179d5eaa026bb7bff43ba47f653d08263a8d9baf9106c658bb90fdc9b625.
{
"label": "owner-fixture-closeout-term-red-01",
"command": [
"env",
"PYTHONPATH=tools/packaging",
"python3",
"-B",
"-m",
"unittest",
"test_packaging.PackageTests.test_constructor_closeout_term_preserves_receipt_and_stage"
],
"delegated": false,
"frozen": null,
"scope": "harness controls only; no candidate acceptance evidence",
"harness_revision": "ea3cb20ac3b9126592251f424e1566eaad260d8b",
"source_status_before": "",
"storage_root": "/run/media/kmosoti/data/FabricO11y",
"admission_bytes": 32236992130,
"admission_observation": {
"data_bytes": 32236992130,
"regular_path_bytes": 32236935122,
"path_count": 378449,
"uid": 0,
"gid": 0,
"attempt": 1
},
"reserved_bytes": 1073741824,
"observations": [],
"started_utc": "2026-10-13T03:07:54.273130+00:00",
"state": "completed",
"log": "/run/media/kmosoti/data/FabricO11y/results/service-opening-candidate/owner-fixture-closeout-term-red-01.log",
"launcher_exit": 1,
"exit": 1,
"source_status_after": "",
"finished_utc": "2026-10-13T03:07:55.279710+00:00",
"log_sha256": "6ae8a1aa31756caa13ec07598e531b73a1becd96fccb1789bb0d9ba4fdf301c9",
"resource_receipts": [
{
"path": "/run/media/kmosoti/data/FabricO11y/results/service-opening-candidate/resource-containment/fabric-work-9e594bbbb3884a0684600370a12c5bbb.json",
"sha256": "093fe85f1fef2569504527d5c52c4ac6473234c2dd09c3591a9aa1063a7d6efa",
"exit": 1,
"stop_confirmed": true,
"retained_failure_evidence": "/run/media/kmosoti/data/FabricO11y/evidence/fabric-work-9e594bbbb3884a0684600370a12c5bbb"
}
]
}
Running as unit: fabric-work-9e594bbbb3884a0684600370a12c5bbb.service
resource group: /user.slice/user-1000.slice/[email protected]/app.slice/fabric-work-9e594bbbb3884a0684600370a12c5bbb.service; memory.max=21474836480; swap.max=0
F
======================================================================
FAIL: test_constructor_closeout_term_preserves_receipt_and_stage (test_packaging.PackageTests.test_constructor_closeout_term_preserves_receipt_and_stage) (interrupted=True)
----------------------------------------------------------------------
Traceback (most recent call last):
File "/run/media/kmosoti/data/FabricO11y/scratch/owner-walkthrough-harness/tools/packaging/test_packaging.py", line 228, in test_constructor_closeout_term_preserves_receipt_and_stage
self.assertTrue(receipt.is_file(), 'closeout TERM lost the actual receipt after staging')
~~~~~~~~~~~~~~~^^^^^^^^^^^^^^^^^^^^^^^^^^^^^^^^^^^^^^^^^^^^^^^^^^^^^^^^^^^^^^^^^^^^^^^^^^
AssertionError: False is not true : closeout TERM lost the actual receipt after staging
----------------------------------------------------------------------
Ran 1 test in 0.200s
FAILED (failures=1)
Finished with result: exit-code
Main processes terminated with: code=exited, status=1/FAILURE
Service runtime: 361ms
CPU time consumed: 309ms
Memory peak: 41.1M (swap: 0B)
Resource receipt SHA256 093fe85f1fef2569504527d5c52c4ac6473234c2dd09c3591a9aa1063a7d6efa.
{
"unit": "fabric-work-9e594bbbb3884a0684600370a12c5bbb",
"command": [
"env",
"PYTHONPATH=tools/packaging",
"python3",
"-B",
"-m",
"unittest",
"test_packaging.PackageTests.test_constructor_closeout_term_preserves_receipt_and_stage"
],
"exit": 1,
"wrapper_exit": 1,
"command_receipt": {
"unit": "fabric-work-9e594bbbb3884a0684600370a12c5bbb",
"command": [
"env",
"PYTHONPATH=tools/packaging",
"python3",
"-B",
"-m",
"unittest",
"test_packaging.PackageTests.test_constructor_closeout_term_preserves_receipt_and_stage"
],
"cgroup": "/sys/fs/cgroup/user.slice/user-1000.slice/[email protected]/app.slice/fabric-work-9e594bbbb3884a0684600370a12c5bbb.service",
"state": "completed",
"exit": 1,
"resource_observation": "command_return_before_service_stop",
"resources": {
"memory.peak": "43139072",
"memory.events": "low 0\nhigh 0\nmax 0\noom 0\noom_kill 0\noom_group_kill 0\nsock_throttled 0",
"cpu.stat": "usage_usec 304286\nuser_usec 258548\nsystem_usec 45737\nnice_usec 0\ncore_sched.force_idle_usec 0\nnr_periods 0\nnr_throttled 0\nthrottled_usec 0\nnr_bursts 0\nburst_usec 0"
}
},
"stop_confirmed": true,
"stop_error": null,
"started_unix": 1791860874.3026295,
"elapsed_s": 0.37517261505126953,
"storage_root": "/run/media/kmosoti/data/FabricO11y",
"temporary": "/run/media/kmosoti/data/FabricO11y/scratch/work-6tq2_43e",
"temporary_removed": true,
"retained_failure_evidence": "/run/media/kmosoti/data/FabricO11y/evidence/fabric-work-9e594bbbb3884a0684600370a12c5bbb",
"memory_high_bytes": 17179869184,
"memory_max_bytes": 21474836480,
"swap_max_bytes": 0,
"runtime_max_seconds": 1800,
"delegated": false
}
The subsequent production correction at 2f420b5204bc46e88460dfb44b7bdae1c13df477 is source-only, awaiting fresh final-head controls and delta review. It is not a green result.
Migrated current-state attribution
The following historical result paragraph was removed from the owned CURRENT.md addition and preserved here. It names old sources and pending state; later results below do not retroactively change it.
- Owner walkthrough tooling. The prospective protocol uses exact candidate bytes with strictly older native fixture metadata. The original 22 failures on
f98a3bfincluded four incorrect positive-mock setup refusals; those four did not reproduce archive escape. With only that mock corrected,4e58b94reproduced four escaped archive exceptions (exit 1, confirmed stop). Corrected focused controls (four methods) and broad packaging/payload controls (17 tests) onea7ba174exited 0 with confirmed stop; the constructor record retains the distinct receipts and raw log hashes. Descendant cleanup and parent-signal controls, native transformation and the fresh owner walkthrough remain pending. No deployment qualification follows from these unit controls.
owner-fixture-final-process-controls-01
Actual at cleanb16aa5f; source-control evidence only. Native construction and walkthrough remain not run.
{
"label": "owner-fixture-final-process-controls-01",
"command": [
"env",
"PYTHONPATH=/run/media/kmosoti/data/FabricO11y/scratch/owner-walkthrough-harness/tools/packaging",
"python3",
"-B",
"-m",
"unittest",
"-v",
"test_packaging.PackageTests.test_build_stops_real_descendant_on_success_and_timeout",
"test_packaging.PackageTests.test_build_final_drain_interruption_preserves_raw_diagnostics",
"test_packaging.PackageTests.test_constructor_parent_term_preserves_interrupted_receipt_and_stage",
"test_packaging.PackageTests.test_constructor_closeout_term_preserves_receipt_and_stage",
"test_payload.PayloadTests.test_extraction_stops_real_descendant_on_success_and_timeout"
],
"delegated": false,
"frozen": null,
"scope": "harness controls only; no candidate acceptance evidence",
"harness_revision": "b16aa5f390b9c873e5feac97ef85ea08bd2b79f1",
"source_status_before": "",
"storage_root": "/run/media/kmosoti/data/FabricO11y",
"admission_bytes": 32237578735,
"admission_observation": {
"data_bytes": 32237578735,
"regular_path_bytes": 32237511976,
"path_count": 378518,
"uid": 0,
"gid": 0,
"attempt": 1
},
"reserved_bytes": 1073741824,
"observations": [
{
"unix": 1791862345.4706366,
"data_bytes": 32237588355,
"regular_path_bytes": 32237521596,
"path_count": 378527,
"uid": 0,
"gid": 0,
"attempt": 1
}
],
"started_utc": "2026-10-13T03:31:53.587979+00:00",
"state": "completed",
"log": "/run/media/kmosoti/data/FabricO11y/results/service-opening-candidate/owner-fixture-final-process-controls-01.log",
"launcher_exit": 0,
"exit": 0,
"source_status_after": "",
"finished_utc": "2026-10-13T03:32:28.477884+00:00",
"log_sha256": "1efb27d556a5d2f2b1f1bb003426a022d5d4c0bf9cff800319c773b4e657ecfc",
"resource_receipts": [
{
"path": "/run/media/kmosoti/data/FabricO11y/results/service-opening-candidate/resource-containment/fabric-work-0e1a873878254635b22614601962cf73.json",
"sha256": "cedf8bd38c5b9088f3077d9c3190a1473837907bc93560e1092ce85d7ba88413",
"exit": 0,
"stop_confirmed": true,
"retained_failure_evidence": null
}
]
}
Running as unit: fabric-work-0e1a873878254635b22614601962cf73.service
resource group: /user.slice/user-1000.slice/[email protected]/app.slice/fabric-work-0e1a873878254635b22614601962cf73.service; memory.max=21474836480; swap.max=0
test_build_stops_real_descendant_on_success_and_timeout (test_packaging.PackageTests.test_build_stops_real_descendant_on_success_and_timeout) ... resource group: /user.slice/user-1000.slice/[email protected]/app.slice/fabric-work-0e1a873878254635b22614601962cf73.service; memory.max=21474836480; swap.max=0
resource group: /user.slice/user-1000.slice/[email protected]/app.slice/fabric-work-0e1a873878254635b22614601962cf73.service; memory.max=21474836480; swap.max=0
ok
test_build_final_drain_interruption_preserves_raw_diagnostics (test_packaging.PackageTests.test_build_final_drain_interruption_preserves_raw_diagnostics) ... resource group: /user.slice/user-1000.slice/[email protected]/app.slice/fabric-work-0e1a873878254635b22614601962cf73.service; memory.max=21474836480; swap.max=0
ok
test_constructor_parent_term_preserves_interrupted_receipt_and_stage (test_packaging.PackageTests.test_constructor_parent_term_preserves_interrupted_receipt_and_stage) ... resource group: /user.slice/user-1000.slice/[email protected]/app.slice/fabric-work-0e1a873878254635b22614601962cf73.service; memory.max=21474836480; swap.max=0
ok
test_constructor_closeout_term_preserves_receipt_and_stage (test_packaging.PackageTests.test_constructor_closeout_term_preserves_receipt_and_stage) ... ok
test_extraction_stops_real_descendant_on_success_and_timeout (test_payload.PayloadTests.test_extraction_stops_real_descendant_on_success_and_timeout) ... resource group: /user.slice/user-1000.slice/[email protected]/app.slice/fabric-work-0e1a873878254635b22614601962cf73.service; memory.max=21474836480; swap.max=0
resource group: /user.slice/user-1000.slice/[email protected]/app.slice/fabric-work-0e1a873878254635b22614601962cf73.service; memory.max=21474836480; swap.max=0
ok
----------------------------------------------------------------------
Ran 5 tests in 33.775s
OK
Finished with result: success
Main processes terminated with: code=exited, status=0/SUCCESS
Service runtime: 33.939s
CPU time consumed: 632ms
Memory peak: 46.9M (swap: 0B)
{
"unit": "fabric-work-0e1a873878254635b22614601962cf73",
"command": [
"env",
"PYTHONPATH=/run/media/kmosoti/data/FabricO11y/scratch/owner-walkthrough-harness/tools/packaging",
"python3",
"-B",
"-m",
"unittest",
"-v",
"test_packaging.PackageTests.test_build_stops_real_descendant_on_success_and_timeout",
"test_packaging.PackageTests.test_build_final_drain_interruption_preserves_raw_diagnostics",
"test_packaging.PackageTests.test_constructor_parent_term_preserves_interrupted_receipt_and_stage",
"test_packaging.PackageTests.test_constructor_closeout_term_preserves_receipt_and_stage",
"test_payload.PayloadTests.test_extraction_stops_real_descendant_on_success_and_timeout"
],
"exit": 0,
"wrapper_exit": 0,
"command_receipt": {
"unit": "fabric-work-0e1a873878254635b22614601962cf73",
"command": [
"env",
"PYTHONPATH=/run/media/kmosoti/data/FabricO11y/scratch/owner-walkthrough-harness/tools/packaging",
"python3",
"-B",
"-m",
"unittest",
"-v",
"test_packaging.PackageTests.test_build_stops_real_descendant_on_success_and_timeout",
"test_packaging.PackageTests.test_build_final_drain_interruption_preserves_raw_diagnostics",
"test_packaging.PackageTests.test_constructor_parent_term_preserves_interrupted_receipt_and_stage",
"test_packaging.PackageTests.test_constructor_closeout_term_preserves_receipt_and_stage",
"test_payload.PayloadTests.test_extraction_stops_real_descendant_on_success_and_timeout"
],
"cgroup": "/sys/fs/cgroup/user.slice/user-1000.slice/[email protected]/app.slice/fabric-work-0e1a873878254635b22614601962cf73.service",
"state": "completed",
"exit": 0,
"resource_observation": "command_return_before_service_stop",
"resources": {
"memory.peak": "49270784",
"memory.events": "low 0\nhigh 0\nmax 0\noom 0\noom_kill 0\noom_group_kill 0\nsock_throttled 0",
"cpu.stat": "usage_usec 626952\nuser_usec 497883\nsystem_usec 129068\nnice_usec 0\ncore_sched.force_idle_usec 0\nnr_periods 0\nnr_throttled 0\nthrottled_usec 0\nnr_bursts 0\nburst_usec 0"
}
},
"stop_confirmed": true,
"stop_error": null,
"started_unix": 1791862313.617332,
"elapsed_s": 33.9539749622345,
"storage_root": "/run/media/kmosoti/data/FabricO11y",
"temporary": "/run/media/kmosoti/data/FabricO11y/scratch/work-58cqvdwr",
"temporary_removed": true,
"retained_failure_evidence": null,
"memory_high_bytes": 17179869184,
"memory_max_bytes": 21474836480,
"swap_max_bytes": 0,
"runtime_max_seconds": 1800,
"delegated": false
}
owner-fixture-final-packaging-payload-01
Actual at cleanb16aa5f; source-control evidence only. Native construction and walkthrough remain not run.
{
"label": "owner-fixture-final-packaging-payload-01",
"command": [
"env",
"PYTHONPATH=/run/media/kmosoti/data/FabricO11y/scratch/owner-walkthrough-harness/tools/packaging",
"python3",
"-B",
"-m",
"unittest",
"discover",
"-s",
"tools/packaging",
"-p",
"test_*.py",
"-v"
],
"delegated": false,
"frozen": null,
"scope": "harness controls only; no candidate acceptance evidence",
"harness_revision": "b16aa5f390b9c873e5feac97ef85ea08bd2b79f1",
"source_status_before": "",
"storage_root": "/run/media/kmosoti/data/FabricO11y",
"admission_bytes": 32250704771,
"admission_observation": {
"data_bytes": 32250704771,
"regular_path_bytes": 32250638012,
"path_count": 380557,
"uid": 0,
"gid": 0,
"attempt": 1
},
"reserved_bytes": 1073741824,
"observations": [
{
"unix": 1791862468.3426273,
"data_bytes": 32250715557,
"regular_path_bytes": 32250648798,
"path_count": 380566,
"uid": 0,
"gid": 0,
"attempt": 1
}
],
"started_utc": "2026-10-13T03:33:56.460685+00:00",
"state": "completed",
"log": "/run/media/kmosoti/data/FabricO11y/results/service-opening-candidate/owner-fixture-final-packaging-payload-01.log",
"launcher_exit": 0,
"exit": 0,
"source_status_after": "",
"finished_utc": "2026-10-13T03:34:31.348777+00:00",
"log_sha256": "715086378896c8e4981fd79a00899f55b4b2754ebec819baadbad1e35b133554",
"resource_receipts": [
{
"path": "/run/media/kmosoti/data/FabricO11y/results/service-opening-candidate/resource-containment/fabric-work-eb6e2dee1d6b45b88eafddb1bea32996.json",
"sha256": "fe86c3ee127caea0eb6d0b16c6aaefb7a68490bd4b1564d08d8c2526efa62935",
"exit": 0,
"stop_confirmed": true,
"retained_failure_evidence": null
}
]
}
Running as unit: fabric-work-eb6e2dee1d6b45b88eafddb1bea32996.service
resource group: /user.slice/user-1000.slice/[email protected]/app.slice/fabric-work-eb6e2dee1d6b45b88eafddb1bea32996.service; memory.max=21474836480; swap.max=0
test_build_final_drain_interruption_preserves_raw_diagnostics (test_packaging.PackageTests.test_build_final_drain_interruption_preserves_raw_diagnostics) ... resource group: /user.slice/user-1000.slice/[email protected]/app.slice/fabric-work-eb6e2dee1d6b45b88eafddb1bea32996.service; memory.max=21474836480; swap.max=0
ok
test_build_stops_real_descendant_on_success_and_timeout (test_packaging.PackageTests.test_build_stops_real_descendant_on_success_and_timeout) ... resource group: /user.slice/user-1000.slice/[email protected]/app.slice/fabric-work-eb6e2dee1d6b45b88eafddb1bea32996.service; memory.max=21474836480; swap.max=0
resource group: /user.slice/user-1000.slice/[email protected]/app.slice/fabric-work-eb6e2dee1d6b45b88eafddb1bea32996.service; memory.max=21474836480; swap.max=0
ok
test_candidate_rejects_wrong_version_and_substituted_package (test_packaging.PackageTests.test_candidate_rejects_wrong_version_and_substituted_package) ... ok
test_complete_assets_preserve_identity (test_packaging.PackageTests.test_complete_assets_preserve_identity) ... ok
test_console_icons_carry_no_build_timestamp (test_packaging.PackageTests.test_console_icons_carry_no_build_timestamp) ... ok
test_constructor_closeout_term_preserves_receipt_and_stage (test_packaging.PackageTests.test_constructor_closeout_term_preserves_receipt_and_stage) ... ok
test_constructor_parent_term_preserves_interrupted_receipt_and_stage (test_packaging.PackageTests.test_constructor_parent_term_preserves_interrupted_receipt_and_stage) ... resource group: /user.slice/user-1000.slice/[email protected]/app.slice/fabric-work-eb6e2dee1d6b45b88eafddb1bea32996.service; memory.max=21474836480; swap.max=0
ok
test_interrupted_predecessor_reversion_exits_nonzero (test_packaging.PackageTests.test_interrupted_predecessor_reversion_exits_nonzero) ... ok
test_mpl_source_archive_identity_and_tamper_refusal (test_packaging.PackageTests.test_mpl_source_archive_identity_and_tamper_refusal) ... ok
test_packagers_have_valid_shell_syntax (test_packaging.PackageTests.test_packagers_have_valid_shell_syntax) ... ok
test_preinstall_refuses_root_ids_without_touching_host_accounts (test_packaging.PackageTests.test_preinstall_refuses_root_ids_without_touching_host_accounts) ... ok
test_same_code_fixture_archive_errors_preserve_failed_receipt (test_packaging.PackageTests.test_same_code_fixture_archive_errors_preserve_failed_receipt) ... ok
test_same_code_fixture_deb_tar_header_controls (test_packaging.PackageTests.test_same_code_fixture_deb_tar_header_controls) ... ok
test_same_code_fixture_rpm_provide_and_weak_dependency_controls (test_packaging.PackageTests.test_same_code_fixture_rpm_provide_and_weak_dependency_controls) ... ok
test_same_code_fixture_source_and_literal_transform_controls (test_packaging.PackageTests.test_same_code_fixture_source_and_literal_transform_controls) ... ok
test_server_and_companion_bound_is_below_four_decimal_gb (test_packaging.PackageTests.test_server_and_companion_bound_is_below_four_decimal_gb) ... ok
test_tampered_or_missing_or_unlisted_assets_refused (test_packaging.PackageTests.test_tampered_or_missing_or_unlisted_assets_refused) ... ok
test_unregistered_predecessor_is_refused_before_extracting (test_packaging.PackageTests.test_unregistered_predecessor_is_refused_before_extracting) ... ok
test_exact_content_inventory_with_complete_trailer (test_payload.PayloadTests.test_exact_content_inventory_with_complete_trailer) ... ok
test_extraction_failure_retains_stderr_and_command (test_payload.PayloadTests.test_extraction_failure_retains_stderr_and_command) ... ok
test_extraction_stops_at_cap_before_materializing_oversized_output (test_payload.PayloadTests.test_extraction_stops_at_cap_before_materializing_oversized_output) ... ok
test_extraction_stops_real_descendant_on_success_and_timeout (test_payload.PayloadTests.test_extraction_stops_real_descendant_on_success_and_timeout) ... resource group: /user.slice/user-1000.slice/[email protected]/app.slice/fabric-work-eb6e2dee1d6b45b88eafddb1bea32996.service; memory.max=21474836480; swap.max=0
resource group: /user.slice/user-1000.slice/[email protected]/app.slice/fabric-work-eb6e2dee1d6b45b88eafddb1bea32996.service; memory.max=21474836480; swap.max=0
ok
----------------------------------------------------------------------
Ran 22 tests in 34.024s
OK
{
"state": "failed",
"exit": 2,
"role": "same implementation, lower native metadata only; not historical migration",
"source": {
"original_head": "8fb6f413179b094288316e25845c137440ba23fa",
"source_date_epoch": 1791841113
},
"harness_commit": "1111111111111111111111111111111111111111",
"inputs": {
"/run/media/kmosoti/data/FabricO11y/scratch/work-vvs5m6w1/tmpfgtgpzo_/deb-receipt.json": "e2c21a55dc478a84e35f7301f290bc6b1700f3ca90478156114e093781d4bfc2",
"/run/media/kmosoti/data/FabricO11y/scratch/work-vvs5m6w1/tmpfgtgpzo_/debian": "8b4a5990f23bc91e01b49339ad387721fcf6c6fcdbbd6a6d2e6c4132bc3f8c55",
"/run/media/kmosoti/data/FabricO11y/scratch/work-vvs5m6w1/tmpfgtgpzo_/fedora": "8b4a5990f23bc91e01b49339ad387721fcf6c6fcdbbd6a6d2e6c4132bc3f8c55"
},
"constructor_sha256": "6d76b3de9c688e420fb1b27f28cc52d6a384e9c63472ce66b2c09289c59e12dd",
"payload_parser_sha256": "6bad694d2b56d7ae22967d6ddf87278dc490498098a5704c40b4ba4b8ab1e028",
"input_validator_sha256": "3dfd336bd132fa7d904aea783c81db94f6832bea304474d86250cb2329dbec44",
"rpm_builder_sha256": "f245284304eac4dcc0d7b585ce5446a7d921eb687602cc62c395e87d0ff4e8c5",
"commands": [
{
"command": [
"dpkg-deb",
"-R",
"/run/media/kmosoti/data/FabricO11y/scratch/work-vvs5m6w1/tmpfgtgpzo_/debian",
"/run/media/kmosoti/data/FabricO11y/scratch/work-vvs5m6w1/tmpfgtgpzo_/owner-fixture-f0znayim/deb"
],
"exit": null
}
],
"packages": {},
"native_comparisons": [
{
"command": [
"dpkg",
"--compare-versions",
"0.1.0~alpha.0",
"lt",
"0.1.0~alpha.1"
],
"exit": 0,
"stdout": ""
},
{
"command": [
"rpm",
"--eval",
"%{lua: print(rpm.vercmp('0:0.1.0-0.alpha.0','0:0.1.0-0.alpha.1'))}"
],
"exit": 0,
"stdout": "-1"
}
],
"error": "file could not be opened successfully:\n- method gz: ReadError('not a gzip file')\n- method bz2: ReadError('not a bzip2 file')\n- method xz: ReadError('not an lzma file')\n- method zst: ReadError('not a zstd file')\n- method tar: ReadError('truncated header')",
"failure_evidence": "/run/media/kmosoti/data/FabricO11y/scratch/work-vvs5m6w1/tmpfgtgpzo_/results/out/failed-fixture-work"
}
{
"state": "failed",
"exit": 2,
"role": "same implementation, lower native metadata only; not historical migration",
"source": {
"original_head": "8fb6f413179b094288316e25845c137440ba23fa",
"source_date_epoch": 1791841113
},
"harness_commit": "1111111111111111111111111111111111111111",
"inputs": {
"/run/media/kmosoti/data/FabricO11y/scratch/work-vvs5m6w1/tmpbellze7n/deb-receipt.json": "e2c21a55dc478a84e35f7301f290bc6b1700f3ca90478156114e093781d4bfc2",
"/run/media/kmosoti/data/FabricO11y/scratch/work-vvs5m6w1/tmpbellze7n/debian": "8b4a5990f23bc91e01b49339ad387721fcf6c6fcdbbd6a6d2e6c4132bc3f8c55",
"/run/media/kmosoti/data/FabricO11y/scratch/work-vvs5m6w1/tmpbellze7n/fedora": "8b4a5990f23bc91e01b49339ad387721fcf6c6fcdbbd6a6d2e6c4132bc3f8c55"
},
"constructor_sha256": "6d76b3de9c688e420fb1b27f28cc52d6a384e9c63472ce66b2c09289c59e12dd",
"payload_parser_sha256": "6bad694d2b56d7ae22967d6ddf87278dc490498098a5704c40b4ba4b8ab1e028",
"input_validator_sha256": "3dfd336bd132fa7d904aea783c81db94f6832bea304474d86250cb2329dbec44",
"rpm_builder_sha256": "f245284304eac4dcc0d7b585ce5446a7d921eb687602cc62c395e87d0ff4e8c5",
"commands": [
{
"command": [
"dpkg-deb",
"-R",
"/run/media/kmosoti/data/FabricO11y/scratch/work-vvs5m6w1/tmpbellze7n/debian",
"/run/media/kmosoti/data/FabricO11y/scratch/work-vvs5m6w1/tmpbellze7n/owner-fixture-1tjayfgf/deb"
],
"exit": null
}
],
"packages": {},
"native_comparisons": [
{
"command": [
"dpkg",
"--compare-versions",
"0.1.0~alpha.0",
"lt",
"0.1.0~alpha.1"
],
"exit": 0,
"stdout": ""
},
{
"command": [
"rpm",
"--eval",
"%{lua: print(rpm.vercmp('0:0.1.0-0.alpha.0','0:0.1.0-0.alpha.1'))}"
],
"exit": 0,
"stdout": "-1"
}
],
"error": "Input format not supported by decoder",
"failure_evidence": "/run/media/kmosoti/data/FabricO11y/scratch/work-vvs5m6w1/tmpbellze7n/results/out/failed-fixture-work"
}
{
"state": "failed",
"exit": 2,
"role": "same implementation, lower native metadata only; not historical migration",
"source": {
"original_head": "8fb6f413179b094288316e25845c137440ba23fa",
"source_date_epoch": 1791841113
},
"harness_commit": "1111111111111111111111111111111111111111",
"inputs": {
"/run/media/kmosoti/data/FabricO11y/scratch/work-vvs5m6w1/tmpbpiceeo1/deb-receipt.json": "e2c21a55dc478a84e35f7301f290bc6b1700f3ca90478156114e093781d4bfc2",
"/run/media/kmosoti/data/FabricO11y/scratch/work-vvs5m6w1/tmpbpiceeo1/debian": "8b4a5990f23bc91e01b49339ad387721fcf6c6fcdbbd6a6d2e6c4132bc3f8c55",
"/run/media/kmosoti/data/FabricO11y/scratch/work-vvs5m6w1/tmpbpiceeo1/fedora": "8b4a5990f23bc91e01b49339ad387721fcf6c6fcdbbd6a6d2e6c4132bc3f8c55"
},
"constructor_sha256": "6d76b3de9c688e420fb1b27f28cc52d6a384e9c63472ce66b2c09289c59e12dd",
"payload_parser_sha256": "6bad694d2b56d7ae22967d6ddf87278dc490498098a5704c40b4ba4b8ab1e028",
"input_validator_sha256": "3dfd336bd132fa7d904aea783c81db94f6832bea304474d86250cb2329dbec44",
"rpm_builder_sha256": "f245284304eac4dcc0d7b585ce5446a7d921eb687602cc62c395e87d0ff4e8c5",
"commands": [
{
"command": [
"dpkg-deb",
"-R",
"/run/media/kmosoti/data/FabricO11y/scratch/work-vvs5m6w1/tmpbpiceeo1/debian",
"/run/media/kmosoti/data/FabricO11y/scratch/work-vvs5m6w1/tmpbpiceeo1/owner-fixture-6gcy79q1/deb"
],
"exit": null
}
],
"packages": {},
"native_comparisons": [
{
"command": [
"dpkg",
"--compare-versions",
"0.1.0~alpha.0",
"lt",
"0.1.0~alpha.1"
],
"exit": 0,
"stdout": ""
},
{
"command": [
"rpm",
"--eval",
"%{lua: print(rpm.vercmp('0:0.1.0-0.alpha.0','0:0.1.0-0.alpha.1'))}"
],
"exit": 0,
"stdout": "-1"
}
],
"error": "'literal-required-control-member'",
"failure_evidence": "/run/media/kmosoti/data/FabricO11y/scratch/work-vvs5m6w1/tmpbpiceeo1/results/out/failed-fixture-work"
}
{
"state": "failed",
"exit": 2,
"role": "same implementation, lower native metadata only; not historical migration",
"source": {
"original_head": "8fb6f413179b094288316e25845c137440ba23fa",
"source_date_epoch": 1791841113
},
"harness_commit": "1111111111111111111111111111111111111111",
"inputs": {
"/run/media/kmosoti/data/FabricO11y/scratch/work-vvs5m6w1/tmpp4xpixfo/deb-receipt.json": "e2c21a55dc478a84e35f7301f290bc6b1700f3ca90478156114e093781d4bfc2",
"/run/media/kmosoti/data/FabricO11y/scratch/work-vvs5m6w1/tmpp4xpixfo/debian": "8b4a5990f23bc91e01b49339ad387721fcf6c6fcdbbd6a6d2e6c4132bc3f8c55",
"/run/media/kmosoti/data/FabricO11y/scratch/work-vvs5m6w1/tmpp4xpixfo/fedora": "8b4a5990f23bc91e01b49339ad387721fcf6c6fcdbbd6a6d2e6c4132bc3f8c55"
},
"constructor_sha256": "6d76b3de9c688e420fb1b27f28cc52d6a384e9c63472ce66b2c09289c59e12dd",
"payload_parser_sha256": "6bad694d2b56d7ae22967d6ddf87278dc490498098a5704c40b4ba4b8ab1e028",
"input_validator_sha256": "3dfd336bd132fa7d904aea783c81db94f6832bea304474d86250cb2329dbec44",
"rpm_builder_sha256": "f245284304eac4dcc0d7b585ce5446a7d921eb687602cc62c395e87d0ff4e8c5",
"commands": [
{
"command": [
"dpkg-deb",
"-R",
"/run/media/kmosoti/data/FabricO11y/scratch/work-vvs5m6w1/tmpp4xpixfo/debian",
"/run/media/kmosoti/data/FabricO11y/scratch/work-vvs5m6w1/tmpp4xpixfo/owner-fixture-ufoa4hqt/deb"
],
"exit": null
}
],
"packages": {},
"native_comparisons": [
{
"command": [
"dpkg",
"--compare-versions",
"0.1.0~alpha.0",
"lt",
"0.1.0~alpha.1"
],
"exit": 0,
"stdout": ""
},
{
"command": [
"rpm",
"--eval",
"%{lua: print(rpm.vercmp('0:0.1.0-0.alpha.0','0:0.1.0-0.alpha.1'))}"
],
"exit": 0,
"stdout": "-1"
}
],
"error": "literal truncated archive member",
"failure_evidence": "/run/media/kmosoti/data/FabricO11y/scratch/work-vvs5m6w1/tmpp4xpixfo/results/out/failed-fixture-work"
}
Finished with result: success
Main processes terminated with: code=exited, status=0/SUCCESS
Service runtime: 34.189s
CPU time consumed: 848ms
Memory peak: 47.7M (swap: 0B)
{
"unit": "fabric-work-eb6e2dee1d6b45b88eafddb1bea32996",
"command": [
"env",
"PYTHONPATH=/run/media/kmosoti/data/FabricO11y/scratch/owner-walkthrough-harness/tools/packaging",
"python3",
"-B",
"-m",
"unittest",
"discover",
"-s",
"tools/packaging",
"-p",
"test_*.py",
"-v"
],
"exit": 0,
"wrapper_exit": 0,
"command_receipt": {
"unit": "fabric-work-eb6e2dee1d6b45b88eafddb1bea32996",
"command": [
"env",
"PYTHONPATH=/run/media/kmosoti/data/FabricO11y/scratch/owner-walkthrough-harness/tools/packaging",
"python3",
"-B",
"-m",
"unittest",
"discover",
"-s",
"tools/packaging",
"-p",
"test_*.py",
"-v"
],
"cgroup": "/sys/fs/cgroup/user.slice/user-1000.slice/[email protected]/app.slice/fabric-work-eb6e2dee1d6b45b88eafddb1bea32996.service",
"state": "completed",
"exit": 0,
"resource_observation": "command_return_before_service_stop",
"resources": {
"memory.peak": "50073600",
"memory.events": "low 0\nhigh 0\nmax 0\noom 0\noom_kill 0\noom_group_kill 0\nsock_throttled 0",
"cpu.stat": "usage_usec 843903\nuser_usec 675922\nsystem_usec 167980\nnice_usec 0\ncore_sched.force_idle_usec 0\nnr_periods 0\nnr_throttled 0\nthrottled_usec 0\nnr_bursts 0\nburst_usec 0"
}
},
"stop_confirmed": true,
"stop_error": null,
"started_unix": 1791862436.4903047,
"elapsed_s": 34.204256534576416,
"storage_root": "/run/media/kmosoti/data/FabricO11y",
"temporary": "/run/media/kmosoti/data/FabricO11y/scratch/work-vvs5m6w1",
"temporary_removed": true,
"retained_failure_evidence": null,
"memory_high_bytes": 17179869184,
"memory_max_bytes": 21474836480,
"swap_max_bytes": 0,
"runtime_max_seconds": 1800,
"delegated": false
}
owner-fixture-final-docs-check-02
Actual clean902b1ec, source-only documentation checks. Native fixture construction and walkthrough remain NOT RUN.
{
"label": "owner-fixture-final-docs-check-02",
"command": [
"env",
"PATH=/run/media/kmosoti/data/FabricO11y/tools/bun-1.4.0:/usr/local/bin:/usr/bin:/bin",
"BUN_INSTALL_CACHE_DIR=/run/media/kmosoti/data/FabricO11y/tools/docs-bun-cache",
"/run/media/kmosoti/data/FabricO11y/tools/bun-1.4.0/bun",
"tools/docs/check.mjs"
],
"delegated": false,
"frozen": null,
"scope": "harness controls only; no candidate acceptance evidence",
"harness_revision": "902b1ecbc0d4baaa554659b8c4083d7db0e03554",
"source_status_before": "",
"storage_root": "/run/media/kmosoti/data/FabricO11y",
"admission_bytes": 32250971854,
"admission_observation": {
"data_bytes": 32250971854,
"regular_path_bytes": 32250905095,
"path_count": 380586,
"uid": 0,
"gid": 0,
"attempt": 1
},
"reserved_bytes": 1073741824,
"observations": [],
"started_utc": "2026-10-13T03:39:32.218697+00:00",
"state": "completed",
"log": "/run/media/kmosoti/data/FabricO11y/results/service-opening-candidate/owner-fixture-final-docs-check-02.log",
"launcher_exit": 0,
"exit": 0,
"source_status_after": "",
"finished_utc": "2026-10-13T03:39:34.224307+00:00",
"log_sha256": "3656f0eb75ac797a05cdb2623fb02f6657db0852f46d5ab7b2fc5e9d12f46595",
"resource_receipts": [
{
"path": "/run/media/kmosoti/data/FabricO11y/results/service-opening-candidate/resource-containment/fabric-work-efea0d641afb4c6399c8018150f65939.json",
"sha256": "0caff569ac2821248db2fae69214f49d897c8b02a10948ebfcaf4140e822bab5",
"exit": 0,
"stop_confirmed": true,
"retained_failure_evidence": null
}
]
}
Running as unit: fabric-work-efea0d641afb4c6399c8018150f65939.service
resource group: /user.slice/user-1000.slice/[email protected]/app.slice/fabric-work-efea0d641afb4c6399c8018150f65939.service; memory.max=21474836480; swap.max=0
Declared private/unavailable evidence references: 36; not validated links.
Documentation checks passed.
Finished with result: success
Main processes terminated with: code=exited, status=0/SUCCESS
Service runtime: 1.095s
CPU time consumed: 1.427s
Memory peak: 159.5M (swap: 0B)
Resource SHA256 0caff569ac2821248db2fae69214f49d897c8b02a10948ebfcaf4140e822bab5.
{
"unit": "fabric-work-efea0d641afb4c6399c8018150f65939",
"command": [
"env",
"PATH=/run/media/kmosoti/data/FabricO11y/tools/bun-1.4.0:/usr/local/bin:/usr/bin:/bin",
"BUN_INSTALL_CACHE_DIR=/run/media/kmosoti/data/FabricO11y/tools/docs-bun-cache",
"/run/media/kmosoti/data/FabricO11y/tools/bun-1.4.0/bun",
"tools/docs/check.mjs"
],
"exit": 0,
"wrapper_exit": 0,
"command_receipt": {
"unit": "fabric-work-efea0d641afb4c6399c8018150f65939",
"command": [
"env",
"PATH=/run/media/kmosoti/data/FabricO11y/tools/bun-1.4.0:/usr/local/bin:/usr/bin:/bin",
"BUN_INSTALL_CACHE_DIR=/run/media/kmosoti/data/FabricO11y/tools/docs-bun-cache",
"/run/media/kmosoti/data/FabricO11y/tools/bun-1.4.0/bun",
"tools/docs/check.mjs"
],
"cgroup": "/sys/fs/cgroup/user.slice/user-1000.slice/[email protected]/app.slice/fabric-work-efea0d641afb4c6399c8018150f65939.service",
"state": "completed",
"exit": 0,
"resource_observation": "command_return_before_service_stop",
"resources": {
"memory.peak": "167284736",
"memory.events": "low 0\nhigh 0\nmax 0\noom 0\noom_kill 0\noom_group_kill 0\nsock_throttled 0",
"cpu.stat": "usage_usec 1422049\nuser_usec 1267228\nsystem_usec 154820\nnice_usec 0\ncore_sched.force_idle_usec 0\nnr_periods 0\nnr_throttled 0\nthrottled_usec 0\nnr_bursts 0\nburst_usec 0"
}
},
"stop_confirmed": true,
"stop_error": null,
"started_unix": 1791862772.2485573,
"elapsed_s": 1.1093122959136963,
"storage_root": "/run/media/kmosoti/data/FabricO11y",
"temporary": "/run/media/kmosoti/data/FabricO11y/scratch/work-lvz7acil",
"temporary_removed": true,
"retained_failure_evidence": null,
"memory_high_bytes": 17179869184,
"memory_max_bytes": 21474836480,
"swap_max_bytes": 0,
"runtime_max_seconds": 1800,
"delegated": false
}
owner-fixture-final-docs-tests-02
Actual clean902b1ec, source-only documentation checks. Native fixture construction and walkthrough remain NOT RUN.
{
"label": "owner-fixture-final-docs-tests-02",
"command": [
"env",
"PATH=/run/media/kmosoti/data/FabricO11y/tools/bun-1.4.0:/usr/local/bin:/usr/bin:/bin",
"BUN_INSTALL_CACHE_DIR=/run/media/kmosoti/data/FabricO11y/tools/docs-bun-cache",
"/run/media/kmosoti/data/FabricO11y/tools/bun-1.4.0/bun",
"tools/docs/check.test.mjs"
],
"delegated": false,
"frozen": null,
"scope": "harness controls only; no candidate acceptance evidence",
"harness_revision": "902b1ecbc0d4baaa554659b8c4083d7db0e03554",
"source_status_before": "",
"storage_root": "/run/media/kmosoti/data/FabricO11y",
"admission_bytes": 32250977780,
"admission_observation": {
"data_bytes": 32250977780,
"regular_path_bytes": 32250911021,
"path_count": 380590,
"uid": 0,
"gid": 0,
"attempt": 1
},
"reserved_bytes": 1073741824,
"observations": [],
"started_utc": "2026-10-13T03:40:13.044288+00:00",
"state": "completed",
"log": "/run/media/kmosoti/data/FabricO11y/results/service-opening-candidate/owner-fixture-final-docs-tests-02.log",
"launcher_exit": 0,
"exit": 0,
"source_status_after": "",
"finished_utc": "2026-10-13T03:40:33.052453+00:00",
"log_sha256": "ec7d24a06db39b5e5dd033d53acfd2c77120a630326bf10c5aebcbd65be2d12e",
"resource_receipts": [
{
"path": "/run/media/kmosoti/data/FabricO11y/results/service-opening-candidate/resource-containment/fabric-work-69bd8f2b91b64c61b0e28013a7b17a3c.json",
"sha256": "fee0a2631016433f564400d0ee650c633e18ff565500f4b01be3d30de432f2fc",
"exit": 0,
"stop_confirmed": true,
"retained_failure_evidence": null
}
]
}
Running as unit: fabric-work-69bd8f2b91b64c61b0e28013a7b17a3c.service
resource group: /user.slice/user-1000.slice/[email protected]/app.slice/fabric-work-69bd8f2b91b64c61b0e28013a7b17a3c.service; memory.max=21474836480; swap.max=0
PASS exact private reference is declared unavailable in a fresh checkout: expected exit 0, got exit 0
PASS private reference source hash drift is rejected: expected nonzero exit with diagnostic, got exit 1
PASS declared private archive symlink is not traversed or validated: expected exit 0, got exit 0
PASS private reference wildcard target is rejected: expected nonzero exit with diagnostic, got exit 1
PASS forged private reference source hash is rejected: expected nonzero exit with diagnostic, got exit 1
PASS private reference outside experiment data is rejected: expected nonzero exit with diagnostic, got exit 1
PASS private reference traversal target is rejected: expected nonzero exit with diagnostic, got exit 1
PASS private reference absolute target is rejected: expected nonzero exit with diagnostic, got exit 1
PASS private reference bound is enforced: expected nonzero exit with diagnostic, got exit 1
PASS unregistered missing evidence link is rejected: expected nonzero exit with diagnostic, got exit 1
PASS unregistered experiment data symlink outside root is rejected: expected nonzero exit with diagnostic, got exit 1
PASS listed archived target is accepted from a historical record: expected exit 0, got exit 0
PASS missing target absent from the archived list is rejected: expected nonzero exit with diagnostic, got exit 1
PASS listed archived target is rejected from a current document: expected nonzero exit with diagnostic, got exit 1
PASS wildcard archived list entry is rejected: expected nonzero exit with diagnostic, got exit 1
PASS absolute file URI is rejected: expected nonzero exit with diagnostic, got exit 1
PASS relative file URI is rejected: expected nonzero exit with diagnostic, got exit 1
PASS Windows drive link is rejected: expected nonzero exit with diagnostic, got exit 1
PASS Windows drive link with encoded slash is rejected: expected nonzero exit with diagnostic, got exit 1
PASS Windows drive link with encoded backslash is rejected: expected nonzero exit with diagnostic, got exit 1
PASS Windows drive link with encoded colon is rejected: expected nonzero exit with diagnostic, got exit 1
PASS baseline repository documents: expected exit 0, got exit 0
PASS external, mailto, and protocol-relative URLs require no network: expected exit 0, got exit 0
PASS broken relative Markdown link: expected nonzero exit with diagnostic, got exit 1
PASS missing heading fragment: expected nonzero exit with diagnostic, got exit 1
PASS inline image destination is checked: expected nonzero exit with diagnostic, got exit 1
PASS reference-style link destination is checked: expected nonzero exit with diagnostic, got exit 1
PASS reference-style image destination is checked: expected nonzero exit with diagnostic, got exit 1
PASS valid inline link in a GFM table cell: expected exit 0, got exit 0
PASS missing inline link in a GFM table cell: expected nonzero exit with diagnostic, got exit 1
PASS valid image and reference-style destinations: expected exit 0, got exit 0
PASS percent-decoded local path, query, and heading fragment: expected exit 0, got exit 0
PASS second duplicate GitHub heading slug: expected exit 0, got exit 0
PASS nonexistent third duplicate heading slug: expected nonzero exit with diagnostic, got exit 1
PASS root-absolute local link is rejected: expected nonzero exit with diagnostic, got exit 1
PASS inline code and ordinary fenced code do not contain links: expected exit 0, got exit 0
PASS quadruple example fence hides nested Mermaid and links: expected exit 0, got exit 0
PASS valid unmarked Mermaid flowchart fence: expected exit 0, got exit 0
PASS valid standalone Mermaid state diagram: expected exit 0, got exit 0
PASS malformed standalone Mermaid flowchart: expected nonzero exit with diagnostic, got exit 1
PASS malformed real Mermaid fence: expected nonzero exit with diagnostic, got exit 1
PASS malformed Mermaid fence in a blockquote: expected nonzero exit with diagnostic, got exit 1
PASS canonical Mermaid marker with blank line and normalized endings: expected exit 0, got exit 0
PASS root README canonical marker and inline-code marker literal: expected exit 0, got exit 0
PASS canonical Mermaid copy drift: expected nonzero exit with diagnostic, got exit 1
PASS canonical Mermaid marker points to missing file: expected nonzero exit with diagnostic, got exit 1
PASS orphan canonical Mermaid marker: expected nonzero exit with diagnostic, got exit 1
PASS malformed VS Code extensions JSON: expected nonzero exit with diagnostic, got exit 1
PASS malformed Codex hooks JSON: expected nonzero exit with diagnostic, got exit 1
PASS malformed optional architecture graph JSON: expected nonzero exit with diagnostic, got exit 1
PASS duplicate four-digit ADR number: expected nonzero exit with diagnostic, got exit 1
PASS hidden agent skill Markdown is scanned: expected nonzero exit with diagnostic, got exit 1
PASS .git, target, and node_modules trees are skipped: expected exit 0, got exit 0
PASS symlinked directory outside root is not traversed: expected exit 0, got exit 0
PASS link through symlinked file outside root is rejected: expected nonzero exit with diagnostic, got exit 1
55/55 acceptance probes passed
Finished with result: success
Main processes terminated with: code=exited, status=0/SUCCESS
Service runtime: 19.101s
CPU time consumed: 28.018s
Memory peak: 93M (swap: 0B)
Resource SHA256 fee0a2631016433f564400d0ee650c633e18ff565500f4b01be3d30de432f2fc.
{
"unit": "fabric-work-69bd8f2b91b64c61b0e28013a7b17a3c",
"command": [
"env",
"PATH=/run/media/kmosoti/data/FabricO11y/tools/bun-1.4.0:/usr/local/bin:/usr/bin:/bin",
"BUN_INSTALL_CACHE_DIR=/run/media/kmosoti/data/FabricO11y/tools/docs-bun-cache",
"/run/media/kmosoti/data/FabricO11y/tools/bun-1.4.0/bun",
"tools/docs/check.test.mjs"
],
"exit": 0,
"wrapper_exit": 0,
"command_receipt": {
"unit": "fabric-work-69bd8f2b91b64c61b0e28013a7b17a3c",
"command": [
"env",
"PATH=/run/media/kmosoti/data/FabricO11y/tools/bun-1.4.0:/usr/local/bin:/usr/bin:/bin",
"BUN_INSTALL_CACHE_DIR=/run/media/kmosoti/data/FabricO11y/tools/docs-bun-cache",
"/run/media/kmosoti/data/FabricO11y/tools/bun-1.4.0/bun",
"tools/docs/check.test.mjs"
],
"cgroup": "/sys/fs/cgroup/user.slice/user-1000.slice/[email protected]/app.slice/fabric-work-69bd8f2b91b64c61b0e28013a7b17a3c.service",
"state": "completed",
"exit": 0,
"resource_observation": "command_return_before_service_stop",
"resources": {
"memory.peak": "97558528",
"memory.events": "low 0\nhigh 0\nmax 0\noom 0\noom_kill 0\noom_group_kill 0\nsock_throttled 0",
"cpu.stat": "usage_usec 28012765\nuser_usec 24106782\nsystem_usec 3905982\nnice_usec 0\ncore_sched.force_idle_usec 0\nnr_periods 0\nnr_throttled 0\nthrottled_usec 0\nnr_bursts 0\nburst_usec 0"
}
},
"stop_confirmed": true,
"stop_error": null,
"started_unix": 1791862813.0750985,
"elapsed_s": 19.11591076850891,
"storage_root": "/run/media/kmosoti/data/FabricO11y",
"temporary": "/run/media/kmosoti/data/FabricO11y/scratch/work-xoguy01o",
"temporary_removed": true,
"retained_failure_evidence": null,
"memory_high_bytes": 17179869184,
"memory_max_bytes": 21474836480,
"swap_max_bytes": 0,
"runtime_max_seconds": 1800,
"delegated": false
}
owner-fixture-final-docs-hooks-02
Actual clean902b1ec, source-only documentation checks. Native fixture construction and walkthrough remain NOT RUN.
{
"label": "owner-fixture-final-docs-hooks-02",
"command": [
"env",
"PATH=/run/media/kmosoti/data/FabricO11y/tools/bun-1.4.0:/usr/local/bin:/usr/bin:/bin",
"BUN_INSTALL_CACHE_DIR=/run/media/kmosoti/data/FabricO11y/tools/docs-bun-cache",
"python3",
"-B",
"tools/docs/test_hooks.py"
],
"delegated": false,
"frozen": null,
"scope": "harness controls only; no candidate acceptance evidence",
"harness_revision": "902b1ecbc0d4baaa554659b8c4083d7db0e03554",
"source_status_before": "",
"storage_root": "/run/media/kmosoti/data/FabricO11y",
"admission_bytes": 32250989220,
"admission_observation": {
"data_bytes": 32250989220,
"regular_path_bytes": 32250922461,
"path_count": 380594,
"uid": 0,
"gid": 0,
"attempt": 1
},
"reserved_bytes": 1073741824,
"observations": [],
"started_utc": "2026-10-13T03:42:20.875354+00:00",
"state": "completed",
"log": "/run/media/kmosoti/data/FabricO11y/results/service-opening-candidate/owner-fixture-final-docs-hooks-02.log",
"launcher_exit": 0,
"exit": 0,
"source_status_after": "",
"finished_utc": "2026-10-13T03:42:22.881790+00:00",
"log_sha256": "b29b4ad4bffa0a448ec20774c39066bb46fc99a20500e8a7a1a3a428477a5ed1",
"resource_receipts": [
{
"path": "/run/media/kmosoti/data/FabricO11y/results/service-opening-candidate/resource-containment/fabric-work-ecd004f4348b43f095819333a7d4796f.json",
"sha256": "ca655d79486468f2ef64e7c3daf4dd11622dadd53a3b1e27e485a81d8d85f899",
"exit": 0,
"stop_confirmed": true,
"retained_failure_evidence": null
}
]
}
Running as unit: fabric-work-ecd004f4348b43f095819333a7d4796f.service
resource group: /user.slice/user-1000.slice/[email protected]/app.slice/fabric-work-ecd004f4348b43f095819333a7d4796f.service; memory.max=21474836480; swap.max=0
test_broken_link_requests_one_continuation (__main__.HookContract.test_broken_link_requests_one_continuation) ... ok
test_context_is_bounded (__main__.HookContract.test_context_is_bounded) ... ok
test_continuation_guard_reports_remaining_failure (__main__.HookContract.test_continuation_guard_reports_remaining_failure) ... ok
test_malformed_input_fails_explicitly (__main__.HookContract.test_malformed_input_fails_explicitly) ... ok
test_missing_dependencies_are_reported (__main__.HookContract.test_missing_dependencies_are_reported) ... ok
test_missing_runtime_is_not_reported_as_success (__main__.HookContract.test_missing_runtime_is_not_reported_as_success) ... ok
test_missing_state_is_reported (__main__.HookContract.test_missing_state_is_reported) ... ok
test_other_event_is_ignored (__main__.HookContract.test_other_event_is_ignored) ... ok
test_session_start_from_subdirectory (__main__.HookContract.test_session_start_from_subdirectory) ... ok
test_valid_docs_allow_stop (__main__.HookContract.test_valid_docs_allow_stop) ... ok
----------------------------------------------------------------------
Ran 10 tests in 1.287s
OK
Finished with result: success
Main processes terminated with: code=exited, status=0/SUCCESS
Service runtime: 1.403s
CPU time consumed: 1.851s
Memory peak: 95.3M (swap: 0B)
Resource SHA256 ca655d79486468f2ef64e7c3daf4dd11622dadd53a3b1e27e485a81d8d85f899.
{
"unit": "fabric-work-ecd004f4348b43f095819333a7d4796f",
"command": [
"env",
"PATH=/run/media/kmosoti/data/FabricO11y/tools/bun-1.4.0:/usr/local/bin:/usr/bin:/bin",
"BUN_INSTALL_CACHE_DIR=/run/media/kmosoti/data/FabricO11y/tools/docs-bun-cache",
"python3",
"-B",
"tools/docs/test_hooks.py"
],
"exit": 0,
"wrapper_exit": 0,
"command_receipt": {
"unit": "fabric-work-ecd004f4348b43f095819333a7d4796f",
"command": [
"env",
"PATH=/run/media/kmosoti/data/FabricO11y/tools/bun-1.4.0:/usr/local/bin:/usr/bin:/bin",
"BUN_INSTALL_CACHE_DIR=/run/media/kmosoti/data/FabricO11y/tools/docs-bun-cache",
"python3",
"-B",
"tools/docs/test_hooks.py"
],
"cgroup": "/sys/fs/cgroup/user.slice/user-1000.slice/[email protected]/app.slice/fabric-work-ecd004f4348b43f095819333a7d4796f.service",
"state": "completed",
"exit": 0,
"resource_observation": "command_return_before_service_stop",
"resources": {
"memory.peak": "100012032",
"memory.events": "low 0\nhigh 0\nmax 0\noom 0\noom_kill 0\noom_group_kill 0\nsock_throttled 0",
"cpu.stat": "usage_usec 1845863\nuser_usec 1597694\nsystem_usec 248168\nnice_usec 0\ncore_sched.force_idle_usec 0\nnr_periods 0\nnr_throttled 0\nthrottled_usec 0\nnr_bursts 0\nburst_usec 0"
}
},
"stop_confirmed": true,
"stop_error": null,
"started_unix": 1791862940.9057202,
"elapsed_s": 1.4175851345062256,
"storage_root": "/run/media/kmosoti/data/FabricO11y",
"temporary": "/run/media/kmosoti/data/FabricO11y/scratch/work-0ozu43zu",
"temporary_removed": true,
"retained_failure_evidence": null,
"memory_high_bytes": 17179869184,
"memory_max_bytes": 21474836480,
"swap_max_bytes": 0,
"runtime_max_seconds": 1800,
"delegated": false
}